BDBM261335 R-5-{3-[1-(4-amino-3-methyl-1H-pyrazolo[3,4-d]pyrimidin-1-yl)ethyl]-5-chloro-2-ethoxy-6-fluorophenyl}-1,3-oxazolidin-2-one::US10092570, Example 357::US9707233, 355
SMILES CCOc1c(cc(Cl)c(F)c1C1CNC(=O)O1)[C@@H](C)n1nc(C)c2c(N)ncnc12
InChI Key InChIKey=NENZZUFAAHFIPT-PKEIRNPWSA-N
Data  3 IC50
  Tab Delimited (TSV)   2D SDfile   Computed 3D by Vconf -m prep SDfile
Find this compound or compounds like it in BindingDB:
Activity Spreadsheet -- Enzyme Inhibition Constant Data from BindingDB
Found 3 hits for monomerid = 261335
LigandPNGBDBM261335(R-5-{3-[1-(4-amino-3-methyl-1H-pyrazolo[3,4-d]pyri...)
Affinity DataIC50:  125nMpH: 6.7 T: 2°C. Assay description: Lipid kinase substrate, phosphoinositol-4,5-bisphosphate (PIP2), are purchased from Echelon Biosciences (Salt Lake City, Utah). PI3K isoforms α,...
Ligand InfoPC cidPC sid
In DepthDetails US Patent
TargetPhosphatidylinositol 4,5-bisphosphate 3-kinase catalytic subunit delta isoform(Homo sapiens (Human))
Incyte Holdings
US Patent
LigandPNGBDBM261335(R-5-{3-[1-(4-amino-3-methyl-1H-pyrazolo[3,4-d]pyri...)
Affinity DataIC50: <10nMpH: 6.7 T: 2°C. Assay description: [γ-33P]ATP (10 mCi/mL) was purchased from Perkin-Elmer (Waltham, Mass.). Lipid kinase substrate, D-myo-Phosphatidylinositol 4,5-bisphosphate (Pt...
Ligand InfoPC cidPC sid
In DepthDetails US Patent
TargetPhosphatidylinositol 4,5-bisphosphate 3-kinase catalytic subunit delta isoform(Homo sapiens (Human))
Incyte Holdings
US Patent
LigandPNGBDBM261335(R-5-{3-[1-(4-amino-3-methyl-1H-pyrazolo[3,4-d]pyri...)
Affinity DataIC50:  125nMpH: 6.7 T: 2°C. Assay description: [γ-33P]ATP (10 mCi/mL) was purchased from Perkin-Elmer (Waltham, Mass.). Lipid kinase substrate, D-myo-Phosphatidylinositol 4,5-bisphosphate (Pt...
Ligand InfoPC cidPC sid
In DepthDetails US Patent