BDBM26138 (2-methoxyphenyl)boranediol::Phenylboronic Acid, 17
SMILES COc1ccccc1B(O)O
InChI Key InChIKey=ROEQGIFOWRQYHD-UHFFFAOYSA-N
Data  2 IC50
  Tab Delimited (TSV)   2D SDfile   Computed 3D by Vconf -m prep SDfile
Find this compound or compounds like it in BindingDB:
Activity Spreadsheet -- Enzyme Inhibition Constant Data from BindingDB
Found 3 hits for monomerid = 26138
TargetFatty-acid amide hydrolase 1 [30-579](Rattus norvegicus (rat))
University Of Oxford
LigandPNGBDBM26138((2-methoxyphenyl)boranediol | Phenylboronic Acid, ...)
Affinity DataIC50:  1.30E+4nMpH: 7.4 T: 2°C. Assay description: [3H]Ethanolamine produced from [3H]AEA hydrolysis was used to calculate FAAH activity and was measured by scintillation counting of the aqueous phase...
In DepthDetails ArticlePubMed
TargetEctonucleotide pyrophosphatase/phosphodiesterase family member 2(Homo sapiens (Human))
Takeda California
Curated by ChEMBL
LigandPNGBDBM26138((2-methoxyphenyl)boranediol | Phenylboronic Acid, ...)
Affinity DataIC50:  3.98E+3nM. Assay description: Inhibition of full length human C-terminal 6-His-tagged ATXbeta using FS-3 as substrate preincubated for 20 mins followed by substrate addition by fl...
In DepthDetails ArticlePubMed
TargetMonoglyceride lipase(Homo sapiens (Human))
University Of Oxford
LigandPNGBDBM26138((2-methoxyphenyl)boranediol | Phenylboronic Acid, ...)
Affinity Data. Assay description: The endpoint enzymatic assay was developed to quantify human recombinant MGL activity with 2-AG. The formation of arachidonic acid and depletion of ...
In DepthDetails ArticlePubMed