BDBM261399 US9708253, 57
SMILES Fc1ccc(cc1)S(=O)(=O)[C@@]1(CC[C@@H](CC1)NC(=O)c1cnccn1)c1ccc(cc1)C(F)(C(F)(F)F)C(F)(F)F
InChI Key InChIKey=QOIHBCFTILIVRZ-OKDJAKQTSA-N
Data  1 IC50
  Tab Delimited (TSV)   2D SDfile   Computed 3D by Vconf -m prep SDfile
Find this compound or compounds like it in BindingDB:
Activity Spreadsheet -- Enzyme Inhibition Constant Data from BindingDB
Found 1 hit for monomerid = 261399
TargetNuclear receptor ROR-gamma(Homo sapiens (Human))
Bristol-Myers Squibb
US Patent
LigandPNGBDBM261399(US9708253, 57)
Affinity DataIC50:  119nMT: 2°C. Assay description: The binding of potential ligands to RORγ is measured by competition with [3H]25-hydroxycholesterol (Perkin Elmer NET674250UC) using a scintillat...
Ligand InfoPC cidPC sid
In DepthDetails US Patent