BDBM261436 N-(4-((4-fluorophenyl)sulfonyl)-1-methyl-4-(4-(perfluoropropan-2-yl)phenyl)cyclohexyl)-2-(pyridin-4-yl)acetamide::US9708253, 95
SMILES CC(C)(C)OC(=O)NC1(C)CCC(CC1)(c1ccc(cc1)C(O)(C(F)(F)F)C(F)(F)F)S(=O)(=O)c1ccc(F)cc1
InChI Key InChIKey=RWCRGGMGGFHEGJ-UHFFFAOYSA-N
Data  1 IC50
  Tab Delimited (TSV)   2D SDfile   Computed 3D by Vconf -m prep SDfile
Find this compound or compounds like it in BindingDB:
Activity Spreadsheet -- Enzyme Inhibition Constant Data from BindingDB
Found 1 hit for monomerid = 261436
TargetNuclear receptor ROR-gamma(Homo sapiens (Human))
Bristol-Myers Squibb
US Patent
LigandPNGBDBM261436(N-(4-((4-fluorophenyl)sulfonyl)-1-methyl-4-(4-(per...)
Affinity DataIC50:  193nMT: 2°C. Assay description: The binding of potential ligands to RORγ is measured by competition with [3H]25-hydroxycholesterol (Perkin Elmer NET674250UC) using a scintillat...
Ligand InfoPC cidPC sid
In DepthDetails US Patent