BDBM261459 1-((1s,4s)-4-(4-fluorophenylsulfonyl)-4-(4-(perfluoropropan-2-yl)phenyl)cyclohexyl)-1H-1,2,3-triazole-4-carboxylic acid::US9708253, 118
SMILES OC(=O)c1cn(nn1)[C@H]1CC[C@@](CC1)(c1ccc(cc1)C(F)(C(F)(F)F)C(F)(F)F)S(=O)(=O)c1ccc(F)cc1
InChI Key InChIKey=OVZWOIIJIIJIBN-UEDWGHLCSA-N
Data  1 IC50
  Tab Delimited (TSV)   2D SDfile   Computed 3D by Vconf -m prep SDfile
Find this compound or compounds like it in BindingDB:
Activity Spreadsheet -- Enzyme Inhibition Constant Data from BindingDB
Found 1 hit for monomerid = 261459
TargetNuclear receptor ROR-gamma(Homo sapiens (Human))
Bristol-Myers Squibb
US Patent
LigandPNGBDBM261459(1-((1s,4s)-4-(4-fluorophenylsulfonyl)-4-(4-(perflu...)
Affinity DataIC50:  289nMT: 2°C. Assay description: The binding of potential ligands to RORγ is measured by competition with [3H]25-hydroxycholesterol (Perkin Elmer NET674250UC) using a scintillat...
Ligand InfoPC cidPC sid
In DepthDetails US Patent