BDBM261474 US9708253, 133
SMILES Fc1ccc(cc1)S(=O)(=O)C1(CCC(CC1)C(=O)NCC1CCS(=O)(=O)CC1)c1ccc(cc1)C(F)(C(F)(F)F)C(F)(F)F
InChI Key InChIKey=JFBQAECZMZTBNA-UHFFFAOYSA-N
Data  1 IC50
  Tab Delimited (TSV)   2D SDfile   Computed 3D by Vconf -m prep SDfile
Find this compound or compounds like it in BindingDB:
Activity Spreadsheet -- Enzyme Inhibition Constant Data from BindingDB
Found 1 hit for monomerid = 261474
TargetNuclear receptor ROR-gamma(Homo sapiens (Human))
Bristol-Myers Squibb
US Patent
LigandPNGBDBM261474(US9708253, 133)
Affinity DataIC50:  47nMT: 2°C. Assay description: The binding of potential ligands to RORγ is measured by competition with [3H]25-hydroxycholesterol (Perkin Elmer NET674250UC) using a scintillat...
Ligand InfoPC cidPC sid
In DepthDetails US Patent