BDBM261570 US9708270, 65
SMILES Cc1ccc(cc1N1CCC2(CCC(CC(O)=O)CC2)CC1)C#N
InChI Key InChIKey=LJPANJUDGUWDBL-UHFFFAOYSA-N
Data  1 EC50
  Tab Delimited (TSV)   2D SDfile   Computed 3D by Vconf -m prep SDfile
Find this compound or compounds like it in BindingDB:
Activity Spreadsheet -- Enzyme Inhibition Constant Data from BindingDB
Found 1 hit for monomerid = 261570
TargetFree fatty acid receptor 4(Homo sapiens (Human))
Merck Sharp & Dohme
US Patent
LigandPNGBDBM261570(US9708270, 65)
Affinity DataEC50:  2.51E+3nM. Assay description: On the day before the measurement day, CHO cells expressing human GPR120 were plated at 10000 cells per well in a 384-well black plate (#3702, Cornin...
Ligand InfoPC cidPC sid
In DepthDetails US Patent