BDBM261613 (S)-4-benzyl-1-(2,2-diphenylacetyl)piperazine-2-carboxylic acid::US9708275, Compound 5
SMILES OC(=O)[C@@H]1CN(Cc2ccccc2)CCN1C(=O)C(c1ccccc1)c1ccccc1
InChI Key InChIKey=ZMZGZQJLFLTKTI-QHCPKHFHSA-N
Data  1 IC50
  Tab Delimited (TSV)   2D SDfile   Computed 3D by Vconf -m prep SDfile
Find this compound or compounds like it in BindingDB:
Activity Spreadsheet -- Enzyme Inhibition Constant Data from BindingDB
Found 1 hit for monomerid = 261613
TargetType-2 angiotensin II receptor(Homo sapiens (Human))
Novartis
US Patent
LigandPNGBDBM261613((S)-4-benzyl-1-(2,2-diphenylacetyl)piperazine-2-ca...)
Affinity DataIC50:  383nM. Assay description: 120 μL membrane (5 mg protein/well) was incubated with 15 μL of [125I]-CGP42112A and 15 μL of compound at RT for 1.5 hrs.The binding r...
Ligand InfoPC cidPC sid
In DepthDetails US Patent