BDBM261678 US9708295, 17
SMILES COc1nc(ncc1-c1cnc(N)c(OC(C)c2c(Cl)ccc(F)c2Cl)c1)N1CCN(CC1)C(C)C
InChI Key InChIKey=FZVSGAVTEHKLAJ-UHFFFAOYSA-N
Data  1 IC50
  Tab Delimited (TSV)   2D SDfile   Computed 3D by Vconf -m prep SDfile
Find this compound or compounds like it in BindingDB:
Activity Spreadsheet -- Enzyme Inhibition Constant Data from BindingDB
Found 1 hit for monomerid = 261678
TargetALK tyrosine kinase receptor(Homo sapiens (Human))
Chia Tai Tianqing Pharmaceutical Group
US Patent
LigandPNGBDBM261678(US9708295, 17)
Affinity DataIC50:  396nM. Assay description: The following method was used to determine ALK kinase inhibitory activity of the compounds of the present invention. The inhibitory activity is indic...
Ligand InfoPC cidPC sid
In DepthDetails US Patent