BDBM26170 2,4-dianilino pyrimidine, 27::3-({4-[(1-methyl-1H-1,3-benzodiazol-6-yl)amino]pyrimidin-2-yl}amino)benzamide
SMILES Cn1cnc2ccc(Nc3ccnc(Nc4cccc(c4)C(N)=O)n3)cc12
InChI Key InChIKey=JAFFJWQQYUBCMN-UHFFFAOYSA-N
Data  1 IC50
  Tab Delimited (TSV)   2D SDfile   Computed 3D by Vconf -m prep SDfile
Find this compound or compounds like it in BindingDB:
Activity Spreadsheet -- Enzyme Inhibition Constant Data from BindingDB
Found 1 hit for monomerid = 26170
LigandPNGBDBM26170(2,4-dianilino pyrimidine, 27 | 3-({4-[(1-methyl-1H...)
Affinity DataIC50:  1.60E+4nMpH: 7.4 T: 2°C. Assay description: Lck activity was assessed using a TR-FRET assay in a 384-well plate format. The degree of phosphorylation of Biotinylated substrate was measured usin...
In DepthDetails ArticlePubMed