BDBM261825 US9708311, 76::[2-(9-Ethyl-9H-carbazol-3-yl)-1-(2-methoxyethyl)-1H-benzimidazol-5-yl](pyrrolidin-1-yl)-methanone
SMILES CCn1c2ccccc2c2cc(ccc12)-c1nc2cc(ccc2n1CCOC)C(=O)N1CCCC1
InChI Key InChIKey=OZBQTUNVJXHZFV-UHFFFAOYSA-N
Data  1 IC50
  Tab Delimited (TSV)   2D SDfile   Computed 3D by Vconf -m prep SDfile
Find this compound or compounds like it in BindingDB:
Activity Spreadsheet -- Enzyme Inhibition Constant Data from BindingDB
Found 1 hit for monomerid = 261825
TargetProstaglandin E2 receptor EP4 subtype(Homo sapiens (Human))
Bayer Pharma Aktiengesellschaft
US Patent
LigandPNGBDBM261825(US9708311, 76 | [2-(9-Ethyl-9H-carbazol-3-yl)-1-(2...)
Affinity DataIC50:  41.3nMT: 2°C. Assay description: 4 μl of a cAMP-d2/cell suspension (625000 cells/ml) were added to a test plate containing the substance solutions already initially introduced (...
Ligand InfoPC cidPC sid
In DepthDetails US Patent