BDBM261829 Azetidin-1-yl[1-(cyclopropylmethyl)-2-(9-ethyl-9H-carbazol-3-yl)-1H-benzimidazol-5-yl]-methanone::US9708311, 80
SMILES CCn1c2ccccc2c2cc(ccc12)-c1nc2cc(ccc2n1CC1CC1)C(=O)N1CCC1
InChI Key InChIKey=GMQNKSLERQWIKN-UHFFFAOYSA-N
Data  1 IC50
  Tab Delimited (TSV)   2D SDfile   Computed 3D by Vconf -m prep SDfile
Find this compound or compounds like it in BindingDB:
Activity Spreadsheet -- Enzyme Inhibition Constant Data from BindingDB
Found 1 hit for monomerid = 261829
TargetProstaglandin E2 receptor EP4 subtype(Homo sapiens (Human))
Bayer Pharma Aktiengesellschaft
US Patent
LigandPNGBDBM261829(Azetidin-1-yl[1-(cyclopropylmethyl)-2-(9-ethyl-9H-...)
Affinity DataIC50:  68.3nMT: 2°C. Assay description: 4 μl of a cAMP-d2/cell suspension (625000 cells/ml) were added to a test plate containing the substance solutions already initially introduced (...
Ligand InfoPC cidPC sid
In DepthDetails US Patent