BDBM261847 Ethyl 1-(2-methoxyethyl)-2-[9-(2-methoxyethyl)-9H-carbazol-3-yl]-1H-benzimidazole-5-carboxylate::US9708311, 97
SMILES CCOC(=O)c1ccc2n(CCOC)c(nc2c1)-c1ccc2n(CCOC)c3ccccc3c2c1
InChI Key InChIKey=AZGOQNLLQXSKFN-UHFFFAOYSA-N
Data  1 IC50
  Tab Delimited (TSV)   2D SDfile   Computed 3D by Vconf -m prep SDfile
Find this compound or compounds like it in BindingDB:
Activity Spreadsheet -- Enzyme Inhibition Constant Data from BindingDB
Found 1 hit for monomerid = 261847
TargetProstaglandin E2 receptor EP4 subtype(Homo sapiens (Human))
Bayer Pharma Aktiengesellschaft
US Patent
LigandPNGBDBM261847(Ethyl 1-(2-methoxyethyl)-2-[9-(2-methoxyethyl)-9H-...)
Affinity DataIC50:  412nMT: 2°C. Assay description: 4 μl of a cAMP-d2/cell suspension (625000 cells/ml) were added to a test plate containing the substance solutions already initially introduced (...
Ligand InfoPC cidPC sid
In DepthDetails US Patent