BDBM261882 1-(Cyclopropylmethyl)-2-(9-ethyl-1-methyl-9H-beta-carbolin-3-yl)-1H-benzimidazole-5-carboxylic acid::US9708311, 131
SMILES CCn1c2ccccc2c2cc(nc(C)c12)-c1nc2cc(ccc2n1CC1CC1)C(O)=O
InChI Key InChIKey=NCSKSDRTTUYJAG-UHFFFAOYSA-N
Data  1 IC50
  Tab Delimited (TSV)   2D SDfile   Computed 3D by Vconf -m prep SDfile
Find this compound or compounds like it in BindingDB:
Activity Spreadsheet -- Enzyme Inhibition Constant Data from BindingDB
Found 1 hit for monomerid = 261882
TargetProstaglandin E2 receptor EP4 subtype(Homo sapiens (Human))
Bayer Pharma Aktiengesellschaft
US Patent
LigandPNGBDBM261882(1-(Cyclopropylmethyl)-2-(9-ethyl-1-methyl-9H-beta-...)
Affinity DataIC50:  480nMT: 2°C. Assay description: 4 μl of a cAMP-d2/cell suspension (625000 cells/ml) were added to a test plate containing the substance solutions already initially introduced (...
Ligand InfoPC cidPC sid
In DepthDetails US Patent