BDBM261928 3-(2,6-difluoro-3,5-dimethoxyphenyl)-7-(1,3-dimethyl-1H-pyrazol-4-yl)-1-propyl-3,4-dihydropyrido[4,3-d]pyrimidin-2(1H)-one::US10251892, Example 30::US10632126, Example 30::US11173162, Example 30::US9708318, 30
SMILES CCCN1C(=O)N(Cc2cnc(cc12)-c1cn(C)nc1C)c1c(F)c(OC)cc(OC)c1F
InChI Key InChIKey=PHKWXJVNVVBZQU-UHFFFAOYSA-N
Data  16 IC50
  Tab Delimited (TSV)   2D SDfile   Computed 3D by Vconf -m prep SDfile
Find this compound or compounds like it in BindingDB:
Activity Spreadsheet -- Enzyme Inhibition Constant Data from BindingDB
Found 16 hits for monomerid = 261928
TargetFibroblast growth factor receptor 1(Homo sapiens (Human))
Incyte
US Patent
LigandPNGBDBM261928(3-(2,6-difluoro-3,5-dimethoxyphenyl)-7-(1,3-dimeth...)
Affinity DataIC50:  20nM. Assay description: FGFR1, FGFR2, and FGFR4 are measured under equivalent conditions with the following changes in enzyme and ATP concentrations: FGFR1, 0.02 nM and 210 ...
Ligand InfoPC cidPC sid
In DepthDetails US Patent
TargetFibroblast growth factor receptor 4(Homo sapiens (Human))
Incyte
US Patent
LigandPNGBDBM261928(3-(2,6-difluoro-3,5-dimethoxyphenyl)-7-(1,3-dimeth...)
Affinity DataIC50:  20nM. Assay description: The inhibitor potency of the exemplified compounds was measured in an enzyme assay that measures peptide phosphorylation using FRET measurements to d...
Ligand InfoPC cidPC sid
In DepthDetails US Patent
TargetFibroblast growth factor receptor 3(Homo sapiens (Human))
Incyte
US Patent
LigandPNGBDBM261928(3-(2,6-difluoro-3,5-dimethoxyphenyl)-7-(1,3-dimeth...)
Affinity DataIC50: <10nM. Assay description: FGFR1, FGFR2, and FGFR4 are measured under equivalent conditions with the following changes in enzyme and ATP concentrations: FGFR1, 0.02 nM and 210 ...
Ligand InfoPC cidPC sid
In DepthDetails US Patent
TargetFibroblast growth factor receptor 4(Homo sapiens (Human))
Incyte
US Patent
LigandPNGBDBM261928(3-(2,6-difluoro-3,5-dimethoxyphenyl)-7-(1,3-dimeth...)
Affinity DataIC50:  20nM. Assay description: FGFR1, FGFR2, and FGFR4 are measured under equivalent conditions with the following changes in enzyme and ATP concentrations: FGFR1, 0.02 nM and 210 ...
Ligand InfoPC cidPC sid
In DepthDetails US Patent
TargetFibroblast growth factor receptor 1(Homo sapiens (Human))
Incyte
US Patent
LigandPNGBDBM261928(3-(2,6-difluoro-3,5-dimethoxyphenyl)-7-(1,3-dimeth...)
Affinity DataIC50:  20nM. Assay description: The inhibitor potency of the exemplified compounds was measured in an enzyme assay that measures peptide phosphorylation using FRET measurements to d...
Ligand InfoPC cidPC sid
In DepthDetails US Patent
TargetFibroblast growth factor receptor 2(Homo sapiens (Human))
Incyte
US Patent
LigandPNGBDBM261928(3-(2,6-difluoro-3,5-dimethoxyphenyl)-7-(1,3-dimeth...)
Affinity DataIC50: <10nM. Assay description: The inhibitor potency of the exemplified compounds was measured in an enzyme assay that measures peptide phosphorylation using FRET measurements to d...
Ligand InfoPC cidPC sid
In DepthDetails US Patent
TargetFibroblast growth factor receptor 3(Homo sapiens (Human))
Incyte
US Patent
LigandPNGBDBM261928(3-(2,6-difluoro-3,5-dimethoxyphenyl)-7-(1,3-dimeth...)
Affinity DataIC50: <10nM. Assay description: The inhibitor potency of the exemplified compounds was measured in an enzyme assay that measures peptide phosphorylation using FRET measurements to d...
Ligand InfoPC cidPC sid
In DepthDetails US Patent
TargetFibroblast growth factor receptor 4(Homo sapiens (Human))
Incyte
US Patent
LigandPNGBDBM261928(3-(2,6-difluoro-3,5-dimethoxyphenyl)-7-(1,3-dimeth...)
Affinity DataIC50:  20nM. Assay description: The inhibitor potency of the exemplified compounds was measured in an enzyme assay that measures peptide phosphorylation using FRET measurements to d...
Ligand InfoPC cidPC sid
In DepthDetails US Patent
TargetFibroblast growth factor receptor 1(Homo sapiens (Human))
Incyte
US Patent
LigandPNGBDBM261928(3-(2,6-difluoro-3,5-dimethoxyphenyl)-7-(1,3-dimeth...)
Affinity DataIC50:  20nM. Assay description: The inhibitor potency of the exemplified compounds was measured in an enzyme assay that measures peptide phosphorylation using FRET measurements to d...
Ligand InfoPC cidPC sid
In DepthDetails US Patent
TargetFibroblast growth factor receptor 2(Homo sapiens (Human))
Incyte
US Patent
LigandPNGBDBM261928(3-(2,6-difluoro-3,5-dimethoxyphenyl)-7-(1,3-dimeth...)
Affinity DataIC50: <10nM. Assay description: The inhibitor potency of the exemplified compounds was measured in an enzyme assay that measures peptide phosphorylation using FRET measurements to d...
Ligand InfoPC cidPC sid
In DepthDetails US Patent
TargetFibroblast growth factor receptor 3(Homo sapiens (Human))
Incyte
US Patent
LigandPNGBDBM261928(3-(2,6-difluoro-3,5-dimethoxyphenyl)-7-(1,3-dimeth...)
Affinity DataIC50: <10nM. Assay description: The inhibitor potency of the exemplified compounds was measured in an enzyme assay that measures peptide phosphorylation using FRET measurements to d...
Ligand InfoPC cidPC sid
In DepthDetails US Patent
TargetFibroblast growth factor receptor 4(Homo sapiens (Human))
Incyte
US Patent
LigandPNGBDBM261928(3-(2,6-difluoro-3,5-dimethoxyphenyl)-7-(1,3-dimeth...)
Affinity DataIC50:  20nM. Assay description: The inhibitor potency of the exemplified compounds was measured in an enzyme assay that measures peptide phosphorylation using FRET measurements to d...
Ligand InfoPC cidPC sid
In DepthDetails US Patent
TargetFibroblast growth factor receptor 1(Homo sapiens (Human))
Incyte
US Patent
LigandPNGBDBM261928(3-(2,6-difluoro-3,5-dimethoxyphenyl)-7-(1,3-dimeth...)
Affinity DataIC50:  20nM. Assay description: The inhibitor potency of the exemplified compounds was measured in an enzyme assay that measures peptide phosphorylation using FRET measurements to d...
Ligand InfoPC cidPC sid
In DepthDetails US Patent
TargetFibroblast growth factor receptor 2(Homo sapiens (Human))
Incyte
US Patent
LigandPNGBDBM261928(3-(2,6-difluoro-3,5-dimethoxyphenyl)-7-(1,3-dimeth...)
Affinity DataIC50: <10nM. Assay description: The inhibitor potency of the exemplified compounds was measured in an enzyme assay that measures peptide phosphorylation using FRET measurements to d...
Ligand InfoPC cidPC sid
In DepthDetails US Patent
TargetFibroblast growth factor receptor 3(Homo sapiens (Human))
Incyte
US Patent
LigandPNGBDBM261928(3-(2,6-difluoro-3,5-dimethoxyphenyl)-7-(1,3-dimeth...)
Affinity DataIC50: <10nM. Assay description: The inhibitor potency of the exemplified compounds was measured in an enzyme assay that measures peptide phosphorylation using FRET measurements to d...
Ligand InfoPC cidPC sid
In DepthDetails US Patent
TargetFibroblast growth factor receptor 2(Homo sapiens (Human))
Incyte
US Patent
LigandPNGBDBM261928(3-(2,6-difluoro-3,5-dimethoxyphenyl)-7-(1,3-dimeth...)
Affinity DataIC50: <10nM. Assay description: FGFR1, FGFR2, and FGFR4 are measured under equivalent conditions with the following changes in enzyme and ATP concentrations: FGFR1, 0.02 nM and 210 ...
Ligand InfoPC cidPC sid
In DepthDetails US Patent