BDBM261998 2-(4-(3-(2,6-difluoro-3,5- dimethoxyphenyl)-7-(1,3- dimethyl-1H-pyrazol-4-yl)-2- oxo-3,4-dihydropyrido[4,3- d]pyrimidin-1(2H)- yl)phenyl)acetonitrile::US10251892, Example 97::US10632126, Example 97::US11173162, Example 97::US9708318, 97
SMILES COc1cc(OC)c(F)c(N2Cc3cnc(cc3N(C2=O)c2ccc(CC#N)cc2)-c2cn(C)nc2C)c1F
InChI Key InChIKey=SWTDYBUUQKFMEW-UHFFFAOYSA-N
Data  16 IC50
  Tab Delimited (TSV)   2D SDfile   Computed 3D by Vconf -m prep SDfile
Find this compound or compounds like it in BindingDB:
Activity Spreadsheet -- Enzyme Inhibition Constant Data from BindingDB
Found 16 hits for monomerid = 261998
TargetFibroblast growth factor receptor 1(Homo sapiens (Human))
Incyte
US Patent
LigandPNGBDBM261998(2-(4-(3-(2,6-difluoro-3,5- dimethoxyphenyl)-7-(1,3...)
Affinity DataIC50:  115nM. Assay description: FGFR1, FGFR2, and FGFR4 are measured under equivalent conditions with the following changes in enzyme and ATP concentrations: FGFR1, 0.02 nM and 210 ...
Ligand InfoKEGGPC cidPC sid
In DepthDetails US Patent
TargetFibroblast growth factor receptor 4(Homo sapiens (Human))
Incyte
US Patent
LigandPNGBDBM261998(2-(4-(3-(2,6-difluoro-3,5- dimethoxyphenyl)-7-(1,3...)
Affinity DataIC50:  115nM. Assay description: The inhibitor potency of the exemplified compounds was measured in an enzyme assay that measures peptide phosphorylation using FRET measurements to d...
Ligand InfoKEGGPC cidPC sid
In DepthDetails US Patent
TargetFibroblast growth factor receptor 3(Homo sapiens (Human))
Incyte
US Patent
LigandPNGBDBM261998(2-(4-(3-(2,6-difluoro-3,5- dimethoxyphenyl)-7-(1,3...)
Affinity DataIC50: <10nM. Assay description: FGFR1, FGFR2, and FGFR4 are measured under equivalent conditions with the following changes in enzyme and ATP concentrations: FGFR1, 0.02 nM and 210 ...
Ligand InfoKEGGPC cidPC sid
In DepthDetails US Patent
TargetFibroblast growth factor receptor 4(Homo sapiens (Human))
Incyte
US Patent
LigandPNGBDBM261998(2-(4-(3-(2,6-difluoro-3,5- dimethoxyphenyl)-7-(1,3...)
Affinity DataIC50:  115nM. Assay description: FGFR1, FGFR2, and FGFR4 are measured under equivalent conditions with the following changes in enzyme and ATP concentrations: FGFR1, 0.02 nM and 210 ...
Ligand InfoKEGGPC cidPC sid
In DepthDetails US Patent
TargetFibroblast growth factor receptor 1(Homo sapiens (Human))
Incyte
US Patent
LigandPNGBDBM261998(2-(4-(3-(2,6-difluoro-3,5- dimethoxyphenyl)-7-(1,3...)
Affinity DataIC50:  115nM. Assay description: The inhibitor potency of the exemplified compounds was measured in an enzyme assay that measures peptide phosphorylation using FRET measurements to d...
Ligand InfoKEGGPC cidPC sid
In DepthDetails US Patent
TargetFibroblast growth factor receptor 2(Homo sapiens (Human))
Incyte
US Patent
LigandPNGBDBM261998(2-(4-(3-(2,6-difluoro-3,5- dimethoxyphenyl)-7-(1,3...)
Affinity DataIC50: <10nM. Assay description: The inhibitor potency of the exemplified compounds was measured in an enzyme assay that measures peptide phosphorylation using FRET measurements to d...
Ligand InfoKEGGPC cidPC sid
In DepthDetails US Patent
TargetFibroblast growth factor receptor 3(Homo sapiens (Human))
Incyte
US Patent
LigandPNGBDBM261998(2-(4-(3-(2,6-difluoro-3,5- dimethoxyphenyl)-7-(1,3...)
Affinity DataIC50: <10nM. Assay description: The inhibitor potency of the exemplified compounds was measured in an enzyme assay that measures peptide phosphorylation using FRET measurements to d...
Ligand InfoKEGGPC cidPC sid
In DepthDetails US Patent
TargetFibroblast growth factor receptor 4(Homo sapiens (Human))
Incyte
US Patent
LigandPNGBDBM261998(2-(4-(3-(2,6-difluoro-3,5- dimethoxyphenyl)-7-(1,3...)
Affinity DataIC50:  115nM. Assay description: The inhibitor potency of the exemplified compounds was measured in an enzyme assay that measures peptide phosphorylation using FRET measurements to d...
Ligand InfoKEGGPC cidPC sid
In DepthDetails US Patent
TargetFibroblast growth factor receptor 1(Homo sapiens (Human))
Incyte
US Patent
LigandPNGBDBM261998(2-(4-(3-(2,6-difluoro-3,5- dimethoxyphenyl)-7-(1,3...)
Affinity DataIC50:  115nM. Assay description: The inhibitor potency of the exemplified compounds was measured in an enzyme assay that measures peptide phosphorylation using FRET measurements to d...
Ligand InfoKEGGPC cidPC sid
In DepthDetails US Patent
TargetFibroblast growth factor receptor 2(Homo sapiens (Human))
Incyte
US Patent
LigandPNGBDBM261998(2-(4-(3-(2,6-difluoro-3,5- dimethoxyphenyl)-7-(1,3...)
Affinity DataIC50: <10nM. Assay description: The inhibitor potency of the exemplified compounds was measured in an enzyme assay that measures peptide phosphorylation using FRET measurements to d...
Ligand InfoKEGGPC cidPC sid
In DepthDetails US Patent
TargetFibroblast growth factor receptor 3(Homo sapiens (Human))
Incyte
US Patent
LigandPNGBDBM261998(2-(4-(3-(2,6-difluoro-3,5- dimethoxyphenyl)-7-(1,3...)
Affinity DataIC50: <10nM. Assay description: The inhibitor potency of the exemplified compounds was measured in an enzyme assay that measures peptide phosphorylation using FRET measurements to d...
Ligand InfoKEGGPC cidPC sid
In DepthDetails US Patent
TargetFibroblast growth factor receptor 4(Homo sapiens (Human))
Incyte
US Patent
LigandPNGBDBM261998(2-(4-(3-(2,6-difluoro-3,5- dimethoxyphenyl)-7-(1,3...)
Affinity DataIC50:  115nM. Assay description: The inhibitor potency of the exemplified compounds was measured in an enzyme assay that measures peptide phosphorylation using FRET measurements to d...
Ligand InfoKEGGPC cidPC sid
In DepthDetails US Patent
TargetFibroblast growth factor receptor 1(Homo sapiens (Human))
Incyte
US Patent
LigandPNGBDBM261998(2-(4-(3-(2,6-difluoro-3,5- dimethoxyphenyl)-7-(1,3...)
Affinity DataIC50:  115nM. Assay description: The inhibitor potency of the exemplified compounds was measured in an enzyme assay that measures peptide phosphorylation using FRET measurements to d...
Ligand InfoKEGGPC cidPC sid
In DepthDetails US Patent
TargetFibroblast growth factor receptor 2(Homo sapiens (Human))
Incyte
US Patent
LigandPNGBDBM261998(2-(4-(3-(2,6-difluoro-3,5- dimethoxyphenyl)-7-(1,3...)
Affinity DataIC50: <10nM. Assay description: The inhibitor potency of the exemplified compounds was measured in an enzyme assay that measures peptide phosphorylation using FRET measurements to d...
Ligand InfoKEGGPC cidPC sid
In DepthDetails US Patent
TargetFibroblast growth factor receptor 3(Homo sapiens (Human))
Incyte
US Patent
LigandPNGBDBM261998(2-(4-(3-(2,6-difluoro-3,5- dimethoxyphenyl)-7-(1,3...)
Affinity DataIC50: <10nM. Assay description: The inhibitor potency of the exemplified compounds was measured in an enzyme assay that measures peptide phosphorylation using FRET measurements to d...
Ligand InfoKEGGPC cidPC sid
In DepthDetails US Patent
TargetFibroblast growth factor receptor 2(Homo sapiens (Human))
Incyte
US Patent
LigandPNGBDBM261998(2-(4-(3-(2,6-difluoro-3,5- dimethoxyphenyl)-7-(1,3...)
Affinity DataIC50: <10nM. Assay description: FGFR1, FGFR2, and FGFR4 are measured under equivalent conditions with the following changes in enzyme and ATP concentrations: FGFR1, 0.02 nM and 210 ...
Ligand InfoKEGGPC cidPC sid
In DepthDetails US Patent