BDBM2620 3-(6-amino-1-methyl-1H-indol-3-yl)-4-(1-methyl-1H-indol-3-yl)-2,5-dihydro-1H-pyrrole-2,5-dione::Bisindolylmaleimide deriv. 42
SMILES Cn1cc(C2=C(C(=O)NC2=O)c2cn(C)c3cc(N)ccc23)c2ccccc12
InChI Key InChIKey=KTAUCQCZXBJXPD-UHFFFAOYSA-N
Data  2 IC50
  Tab Delimited (TSV)   2D SDfile   Computed 3D by Vconf -m prep SDfile
Find this compound or compounds like it in BindingDB:
Activity Spreadsheet -- Enzyme Inhibition Constant Data from BindingDB
Found 2 hits for monomerid = 2620
TargetcAMP-dependent protein kinase catalytic subunit alpha(Bos taurus (bovine))
Roche Products
LigandPNGBDBM2620(3-(6-amino-1-methyl-1H-indol-3-yl)-4-(1-methyl-1H-...)
Affinity DataIC50:  1.45E+4nM. Assay description: The activity of PKA, activated by cAMP, is measured by its ability to transfer phosphate from [gamma-32P]ATP to histone.
In DepthDetails ArticlePubMed
TargetProtein kinase C beta type(Rattus norvegicus (rat))
Roche Products
LigandPNGBDBM2620(3-(6-amino-1-methyl-1H-indol-3-yl)-4-(1-methyl-1H-...)
Affinity DataIC50:  310nM. Assay description: The activity of PKC, activated by phosphatidylerine and Ca2+, is measured by its ability to transfer phosphate from [gamma-32P]ATP to lysine-rich his...
In DepthDetails ArticlePubMed