BDBM262045 2'-(2,6-difluoro-3,5- dimethoxyphenyl)-6'-(3-methyl- 1-(1-methylpyrrolidin-3-yl)-1H- pyrazol-4-yl)-1'H- spiro[cyclopropane-1,4'- [2,7]naphthyridin]-3'(2'H)-one::US10251892, Example 163::US10632126, Example 163::US11173162, Example 163::US9708318, 163
SMILES COc1cc(OC)c(F)c(N2Cc3cnc(cc3C3(CC3)C2=O)-c2cn(nc2C)C2CCN(C)C2)c1F
InChI Key InChIKey=QIEBARONIFSHFN-UHFFFAOYSA-N
Data  16 IC50
  Tab Delimited (TSV)   2D SDfile   Computed 3D by Vconf -m prep SDfile
Find this compound or compounds like it in BindingDB:
Activity Spreadsheet -- Enzyme Inhibition Constant Data from BindingDB
Found 16 hits for monomerid = 262045
TargetFibroblast growth factor receptor 1(Homo sapiens (Human))
Incyte
US Patent
LigandPNGBDBM262045(2'-(2,6-difluoro-3,5- dimethoxyphenyl)-6'-(3-methy...)
Affinity DataIC50:  115nM. Assay description: FGFR1, FGFR2, and FGFR4 are measured under equivalent conditions with the following changes in enzyme and ATP concentrations: FGFR1, 0.02 nM and 210 ...
Ligand InfoPC cidPC sid
In DepthDetails US Patent
TargetFibroblast growth factor receptor 4(Homo sapiens (Human))
Incyte
US Patent
LigandPNGBDBM262045(2'-(2,6-difluoro-3,5- dimethoxyphenyl)-6'-(3-methy...)
Affinity DataIC50:  115nM. Assay description: The inhibitor potency of the exemplified compounds was measured in an enzyme assay that measures peptide phosphorylation using FRET measurements to d...
Ligand InfoPC cidPC sid
In DepthDetails US Patent
TargetFibroblast growth factor receptor 3(Homo sapiens (Human))
Incyte
US Patent
LigandPNGBDBM262045(2'-(2,6-difluoro-3,5- dimethoxyphenyl)-6'-(3-methy...)
Affinity DataIC50: <10nM. Assay description: FGFR1, FGFR2, and FGFR4 are measured under equivalent conditions with the following changes in enzyme and ATP concentrations: FGFR1, 0.02 nM and 210 ...
Ligand InfoPC cidPC sid
In DepthDetails US Patent
TargetFibroblast growth factor receptor 4(Homo sapiens (Human))
Incyte
US Patent
LigandPNGBDBM262045(2'-(2,6-difluoro-3,5- dimethoxyphenyl)-6'-(3-methy...)
Affinity DataIC50:  115nM. Assay description: FGFR1, FGFR2, and FGFR4 are measured under equivalent conditions with the following changes in enzyme and ATP concentrations: FGFR1, 0.02 nM and 210 ...
Ligand InfoPC cidPC sid
In DepthDetails US Patent
TargetFibroblast growth factor receptor 1(Homo sapiens (Human))
Incyte
US Patent
LigandPNGBDBM262045(2'-(2,6-difluoro-3,5- dimethoxyphenyl)-6'-(3-methy...)
Affinity DataIC50:  115nM. Assay description: The inhibitor potency of the exemplified compounds was measured in an enzyme assay that measures peptide phosphorylation using FRET measurements to d...
Ligand InfoPC cidPC sid
In DepthDetails US Patent
TargetFibroblast growth factor receptor 2(Homo sapiens (Human))
Incyte
US Patent
LigandPNGBDBM262045(2'-(2,6-difluoro-3,5- dimethoxyphenyl)-6'-(3-methy...)
Affinity DataIC50: <10nM. Assay description: The inhibitor potency of the exemplified compounds was measured in an enzyme assay that measures peptide phosphorylation using FRET measurements to d...
Ligand InfoPC cidPC sid
In DepthDetails US Patent
TargetFibroblast growth factor receptor 3(Homo sapiens (Human))
Incyte
US Patent
LigandPNGBDBM262045(2'-(2,6-difluoro-3,5- dimethoxyphenyl)-6'-(3-methy...)
Affinity DataIC50: <10nM. Assay description: The inhibitor potency of the exemplified compounds was measured in an enzyme assay that measures peptide phosphorylation using FRET measurements to d...
Ligand InfoPC cidPC sid
In DepthDetails US Patent
TargetFibroblast growth factor receptor 4(Homo sapiens (Human))
Incyte
US Patent
LigandPNGBDBM262045(2'-(2,6-difluoro-3,5- dimethoxyphenyl)-6'-(3-methy...)
Affinity DataIC50:  115nM. Assay description: The inhibitor potency of the exemplified compounds was measured in an enzyme assay that measures peptide phosphorylation using FRET measurements to d...
Ligand InfoPC cidPC sid
In DepthDetails US Patent
TargetFibroblast growth factor receptor 1(Homo sapiens (Human))
Incyte
US Patent
LigandPNGBDBM262045(2'-(2,6-difluoro-3,5- dimethoxyphenyl)-6'-(3-methy...)
Affinity DataIC50:  115nM. Assay description: The inhibitor potency of the exemplified compounds was measured in an enzyme assay that measures peptide phosphorylation using FRET measurements to d...
Ligand InfoPC cidPC sid
In DepthDetails US Patent
TargetFibroblast growth factor receptor 2(Homo sapiens (Human))
Incyte
US Patent
LigandPNGBDBM262045(2'-(2,6-difluoro-3,5- dimethoxyphenyl)-6'-(3-methy...)
Affinity DataIC50: <10nM. Assay description: The inhibitor potency of the exemplified compounds was measured in an enzyme assay that measures peptide phosphorylation using FRET measurements to d...
Ligand InfoPC cidPC sid
In DepthDetails US Patent
TargetFibroblast growth factor receptor 3(Homo sapiens (Human))
Incyte
US Patent
LigandPNGBDBM262045(2'-(2,6-difluoro-3,5- dimethoxyphenyl)-6'-(3-methy...)
Affinity DataIC50: <10nM. Assay description: The inhibitor potency of the exemplified compounds was measured in an enzyme assay that measures peptide phosphorylation using FRET measurements to d...
Ligand InfoPC cidPC sid
In DepthDetails US Patent
TargetFibroblast growth factor receptor 4(Homo sapiens (Human))
Incyte
US Patent
LigandPNGBDBM262045(2'-(2,6-difluoro-3,5- dimethoxyphenyl)-6'-(3-methy...)
Affinity DataIC50:  115nM. Assay description: The inhibitor potency of the exemplified compounds was measured in an enzyme assay that measures peptide phosphorylation using FRET measurements to d...
Ligand InfoPC cidPC sid
In DepthDetails US Patent
TargetFibroblast growth factor receptor 1(Homo sapiens (Human))
Incyte
US Patent
LigandPNGBDBM262045(2'-(2,6-difluoro-3,5- dimethoxyphenyl)-6'-(3-methy...)
Affinity DataIC50:  115nM. Assay description: The inhibitor potency of the exemplified compounds was measured in an enzyme assay that measures peptide phosphorylation using FRET measurements to d...
Ligand InfoPC cidPC sid
In DepthDetails US Patent
TargetFibroblast growth factor receptor 2(Homo sapiens (Human))
Incyte
US Patent
LigandPNGBDBM262045(2'-(2,6-difluoro-3,5- dimethoxyphenyl)-6'-(3-methy...)
Affinity DataIC50: <10nM. Assay description: The inhibitor potency of the exemplified compounds was measured in an enzyme assay that measures peptide phosphorylation using FRET measurements to d...
Ligand InfoPC cidPC sid
In DepthDetails US Patent
TargetFibroblast growth factor receptor 3(Homo sapiens (Human))
Incyte
US Patent
LigandPNGBDBM262045(2'-(2,6-difluoro-3,5- dimethoxyphenyl)-6'-(3-methy...)
Affinity DataIC50: <10nM. Assay description: The inhibitor potency of the exemplified compounds was measured in an enzyme assay that measures peptide phosphorylation using FRET measurements to d...
Ligand InfoPC cidPC sid
In DepthDetails US Patent
TargetFibroblast growth factor receptor 2(Homo sapiens (Human))
Incyte
US Patent
LigandPNGBDBM262045(2'-(2,6-difluoro-3,5- dimethoxyphenyl)-6'-(3-methy...)
Affinity DataIC50: <10nM. Assay description: FGFR1, FGFR2, and FGFR4 are measured under equivalent conditions with the following changes in enzyme and ATP concentrations: FGFR1, 0.02 nM and 210 ...
Ligand InfoPC cidPC sid
In DepthDetails US Patent