BDBM262135 6-Amino-9-[(6-methyl-3-pyridyl)methyl]-2-(propylsulfonimidoyl)-7H-purin-8-one::US11242345, Example 34::US9708325, 34
SMILES CCCS(=N)(=O)c1nc(N)c2[nH]c(=O)n(Cc3ccc(C)nc3)c2n1
InChI Key
Data  2 EC50
  Tab Delimited (TSV)   2D SDfile   Computed 3D by Vconf -m prep SDfile
Find this compound or compounds like it in BindingDB:
Activity Spreadsheet -- Enzyme Inhibition Constant Data from BindingDB
Found 2 hits for monomerid = 262135
TargetToll-like receptor 7(Homo sapiens (Human))
Hoffmann-La Roche
US Patent
LigandPNGBDBM262135(6-Amino-9-[(6-methyl-3-pyridyl)methyl]-2-(propylsu...)
Affinity DataEC50:  30nM. Assay description: A stable HEK-Blue-hTLR7 cell line was purchased from InvivoGen (Cat. #: hkb-htlr7, San Diego, Calif., USA). These cells were designed for studying th...
Ligand InfoPC cidPC sid
In DepthDetails US Patent
TargetToll-like receptor 7(Homo sapiens (Human))
Hoffmann-La Roche
US Patent
LigandPNGBDBM262135(6-Amino-9-[(6-methyl-3-pyridyl)methyl]-2-(propylsu...)
Affinity DataEC50:  30nM. Assay description: HEK-Blue-hTLR7 cells were incubated at a density of 250,000˜450,000 cells/mL in a volume of 180 μL in a 96-well plate in Dulbecco's Mod...
Ligand InfoPC cidPC sid
In DepthDetails US Patent