BDBM262262 3-(3-methyl- [1,2,4]triazolo[4,3-a]pyridin-6- yl)-2-(1H-tetrazol-5- yl)benzenesulfonamide::US9708336, 113
SMILES Cc1nnc2ccc(cn12)-c1cccc(c1-c1nnn[nH]1)S(N)(=O)=O
InChI Key InChIKey=RGWVYRCUONEDCW-UHFFFAOYSA-N
Data  3 IC50
  Tab Delimited (TSV)   2D SDfile   Computed 3D by Vconf -m prep SDfile
Find this compound or compounds like it in BindingDB:
Activity Spreadsheet -- Enzyme Inhibition Constant Data from BindingDB
Found 3 hits for monomerid = 262262
TargetMetallo-beta-lactamase type 2(Serratia marcescens)
Merck Sharp & Dohme
US Patent
LigandPNGBDBM262262(3-(3-methyl- [1,2,4]triazolo[4,3-a]pyridin-6- yl)-...)
Affinity DataIC50:  1.48E+4nMpH: 7.0Assay Description:The Class B enzyme activities were measured in the presence of the test inhibitor in a fluorescence assay against a commercially available substrate ...
Ligand InfoPC cidPC sid
In DepthDetails US Patent
TargetVIM-1 metallo-beta-lactamase(Klebsiella pneumoniae)
Merck Sharp & Dohme
US Patent
LigandPNGBDBM262262(3-(3-methyl- [1,2,4]triazolo[4,3-a]pyridin-6- yl)-...)
Affinity DataIC50:  313nMpH: 7.0Assay Description:The Class B enzyme activities were measured in the presence of the test inhibitor in a fluorescence assay against a commercially available substrate ...
Ligand InfoPC cidPC sid
In DepthDetails US Patent
TargetMetallo-beta-lactamase type 2(Klebsiella pneumoniae)
Merck Sharp & Dohme
US Patent
LigandPNGBDBM262262(3-(3-methyl- [1,2,4]triazolo[4,3-a]pyridin-6- yl)-...)
Affinity DataIC50:  15.4nMpH: 7.0Assay Description:The Class B enzyme activities were measured in the presence of the test inhibitor in a fluorescence assay against a commercially available substrate ...
Ligand InfoPC cidPC sid
In DepthDetails US Patent