BDBM262401 4-Methoxy-2-(2H-tetrazol-5-yl)benzenesulfonamide::US9708336, 253
SMILES COc1ccc(c(c1)-c1nn[nH]n1)S(N)(=O)=O
InChI Key InChIKey=MNHLBYPGGOYQGK-UHFFFAOYSA-N
Data  3 IC50
  Tab Delimited (TSV)   2D SDfile   Computed 3D by Vconf -m prep SDfile
Find this compound or compounds like it in BindingDB:
Activity Spreadsheet -- Enzyme Inhibition Constant Data from BindingDB
Found 3 hits for monomerid = 262401
TargetMetallo-beta-lactamase type 2(Serratia marcescens)
Merck Sharp & Dohme
US Patent
LigandPNGBDBM262401(4-Methoxy-2-(2H-tetrazol-5-yl)benzenesulfonamide |...)
Affinity DataIC50:  4.63E+4nMpH: 7.0Assay Description:The Class B enzyme activities were measured in the presence of the test inhibitor in a fluorescence assay against a commercially available substrate ...
Ligand InfoPC cidPC sid
In DepthDetails US Patent
TargetVIM-1 metallo-beta-lactamase(Klebsiella pneumoniae)
Merck Sharp & Dohme
US Patent
LigandPNGBDBM262401(4-Methoxy-2-(2H-tetrazol-5-yl)benzenesulfonamide |...)
Affinity DataIC50:  1.70E+5nMpH: 7.0Assay Description:The Class B enzyme activities were measured in the presence of the test inhibitor in a fluorescence assay against a commercially available substrate ...
Ligand InfoPC cidPC sid
In DepthDetails US Patent
TargetMetallo-beta-lactamase type 2(Klebsiella pneumoniae)
Merck Sharp & Dohme
US Patent
LigandPNGBDBM262401(4-Methoxy-2-(2H-tetrazol-5-yl)benzenesulfonamide |...)
Affinity DataIC50:  440nMpH: 7.0Assay Description:The Class B enzyme activities were measured in the presence of the test inhibitor in a fluorescence assay against a commercially available substrate ...
Ligand InfoPC cidPC sid
In DepthDetails US Patent