BDBM262467 3-(quinolin-4-yl)-2-(2H-tetrazol- 5-yl)benzenesulfonamide::US9708336, 319
SMILES NS(=O)(=O)c1cccc(-c2ccnc3ccccc23)c1-c1nn[nH]n1
InChI Key InChIKey=WISWQAGRBCJTBN-UHFFFAOYSA-N
Data  3 IC50
  Tab Delimited (TSV)   2D SDfile   Computed 3D by Vconf -m prep SDfile
Find this compound or compounds like it in BindingDB:
Activity Spreadsheet -- Enzyme Inhibition Constant Data from BindingDB
Found 3 hits for monomerid = 262467
TargetMetallo-beta-lactamase type 2(Serratia marcescens)
Merck Sharp & Dohme
US Patent
LigandPNGBDBM262467(3-(quinolin-4-yl)-2-(2H-tetrazol- 5-yl)benzenesulf...)
Affinity DataIC50:  62.2nMpH: 7.0Assay Description:The Class B enzyme activities were measured in the presence of the test inhibitor in a fluorescence assay against a commercially available substrate ...
Ligand InfoPC cidPC sid
In DepthDetails US Patent
TargetVIM-1 metallo-beta-lactamase(Klebsiella pneumoniae)
Merck Sharp & Dohme
US Patent
LigandPNGBDBM262467(3-(quinolin-4-yl)-2-(2H-tetrazol- 5-yl)benzenesulf...)
Affinity DataIC50:  0.886nMpH: 7.0Assay Description:The Class B enzyme activities were measured in the presence of the test inhibitor in a fluorescence assay against a commercially available substrate ...
Ligand InfoPC cidPC sid
In DepthDetails US Patent
TargetMetallo-beta-lactamase type 2(Klebsiella pneumoniae)
Merck Sharp & Dohme
US Patent
LigandPNGBDBM262467(3-(quinolin-4-yl)-2-(2H-tetrazol- 5-yl)benzenesulf...)
Affinity DataIC50:  0.551nMpH: 7.0Assay Description:The Class B enzyme activities were measured in the presence of the test inhibitor in a fluorescence assay against a commercially available substrate ...
Ligand InfoPC cidPC sid
In DepthDetails US Patent