BDBM262547 1-(1H-tetrazol-5-yl)naphthalene-2-sulfonamide::US9708336, 399
SMILES NS(=O)(=O)c1ccc2ccccc2c1-c1nnn[nH]1
InChI Key InChIKey=AKHKLHLESITHHL-UHFFFAOYSA-N
Data  3 IC50
  Tab Delimited (TSV)   2D SDfile   Computed 3D by Vconf -m prep SDfile
Find this compound or compounds like it in BindingDB:
Activity Spreadsheet -- Enzyme Inhibition Constant Data from BindingDB
Found 3 hits for monomerid = 262547
TargetMetallo-beta-lactamase type 2(Serratia marcescens)
Merck Sharp & Dohme
US Patent
LigandPNGBDBM262547(1-(1H-tetrazol-5-yl)naphthalene-2-sulfonamide | US...)
Affinity DataIC50:  1.51E+4nMpH: 7.0Assay Description:The Class B enzyme activities were measured in the presence of the test inhibitor in a fluorescence assay against a commercially available substrate ...
Ligand InfoPC cidPC sid
In DepthDetails US Patent
TargetVIM-1 metallo-beta-lactamase(Klebsiella pneumoniae)
Merck Sharp & Dohme
US Patent
LigandPNGBDBM262547(1-(1H-tetrazol-5-yl)naphthalene-2-sulfonamide | US...)
Affinity DataIC50:  1.24E+4nMpH: 7.0Assay Description:The Class B enzyme activities were measured in the presence of the test inhibitor in a fluorescence assay against a commercially available substrate ...
Ligand InfoPC cidPC sid
In DepthDetails US Patent
TargetMetallo-beta-lactamase type 2(Klebsiella pneumoniae)
Merck Sharp & Dohme
US Patent
LigandPNGBDBM262547(1-(1H-tetrazol-5-yl)naphthalene-2-sulfonamide | US...)
Affinity DataIC50:  117nMpH: 7.0Assay Description:The Class B enzyme activities were measured in the presence of the test inhibitor in a fluorescence assay against a commercially available substrate ...
Ligand InfoPC cidPC sid
In DepthDetails US Patent