BDBM262597 3-(3′-sulfamoyl-2′-(2H-tetrazol-5-yl)-4′-(trifluoromethyl)-[1,1′-biphenyl]-4-yl)propanamide::US9708336, 449
SMILES NC(=O)CCc1ccc(cc1)-c1ccc(c(c1-c1nn[nH]n1)S(N)(=O)=O)C(F)(F)F
InChI Key InChIKey=CGDLGRZQXINUDW-UHFFFAOYSA-N
Data  3 IC50
  Tab Delimited (TSV)   2D SDfile   Computed 3D by Vconf -m prep SDfile
Find this compound or compounds like it in BindingDB:
Activity Spreadsheet -- Enzyme Inhibition Constant Data from BindingDB
Found 3 hits for monomerid = 262597
TargetMetallo-beta-lactamase type 2(Serratia marcescens)
Merck Sharp & Dohme
US Patent
LigandPNGBDBM262597(3-(3′-sulfamoyl-2′-(2H-tetrazol-5-yl)-...)
Affinity DataIC50:  0.537nMpH: 7.0Assay Description:The Class B enzyme activities were measured in the presence of the test inhibitor in a fluorescence assay against a commercially available substrate ...
Ligand InfoPC cidPC sid
In DepthDetails US Patent
TargetVIM-1 metallo-beta-lactamase(Klebsiella pneumoniae)
Merck Sharp & Dohme
US Patent
LigandPNGBDBM262597(3-(3′-sulfamoyl-2′-(2H-tetrazol-5-yl)-...)
Affinity DataIC50:  0.815nMpH: 7.0Assay Description:The Class B enzyme activities were measured in the presence of the test inhibitor in a fluorescence assay against a commercially available substrate ...
Ligand InfoPC cidPC sid
In DepthDetails US Patent
TargetMetallo-beta-lactamase type 2(Klebsiella pneumoniae)
Merck Sharp & Dohme
US Patent
LigandPNGBDBM262597(3-(3′-sulfamoyl-2′-(2H-tetrazol-5-yl)-...)
Affinity DataIC50:  0.653nMpH: 7.0Assay Description:The Class B enzyme activities were measured in the presence of the test inhibitor in a fluorescence assay against a commercially available substrate ...
Ligand InfoPC cidPC sid
In DepthDetails US Patent