BDBM262606 4′-(piperidin-4-yl)-2-(2H-tetrazol-5-yl)-4-(2,2,2- trifluoroethyl)-[1,1′-biphenyl]-3-sulfonamide::US9708336, 458
SMILES NS(=O)(=O)c1c(CC(F)(F)F)ccc(-c2ccc(cc2)C2CCNCC2)c1-c1nn[nH]n1
InChI Key InChIKey=JZTYDZONNZUKRT-UHFFFAOYSA-N
Data  3 IC50
  Tab Delimited (TSV)   2D SDfile   Computed 3D by Vconf -m prep SDfile
Find this compound or compounds like it in BindingDB:
Activity Spreadsheet -- Enzyme Inhibition Constant Data from BindingDB
Found 3 hits for monomerid = 262606
TargetMetallo-beta-lactamase type 2(Serratia marcescens)
Merck Sharp & Dohme
US Patent
LigandPNGBDBM262606(4′-(piperidin-4-yl)-2-(2H-tetrazol-5-yl)-4-(...)
Affinity DataIC50:  2.39nMpH: 7.0Assay Description:The Class B enzyme activities were measured in the presence of the test inhibitor in a fluorescence assay against a commercially available substrate ...
Ligand InfoPC cidPC sid
In DepthDetails US Patent
TargetVIM-1 metallo-beta-lactamase(Klebsiella pneumoniae)
Merck Sharp & Dohme
US Patent
LigandPNGBDBM262606(4′-(piperidin-4-yl)-2-(2H-tetrazol-5-yl)-4-(...)
Affinity DataIC50:  2.12nMpH: 7.0Assay Description:The Class B enzyme activities were measured in the presence of the test inhibitor in a fluorescence assay against a commercially available substrate ...
Ligand InfoPC cidPC sid
In DepthDetails US Patent
TargetMetallo-beta-lactamase type 2(Klebsiella pneumoniae)
Merck Sharp & Dohme
US Patent
LigandPNGBDBM262606(4′-(piperidin-4-yl)-2-(2H-tetrazol-5-yl)-4-(...)
Affinity DataIC50:  22.1nMpH: 7.0Assay Description:The Class B enzyme activities were measured in the presence of the test inhibitor in a fluorescence assay against a commercially available substrate ...
Ligand InfoPC cidPC sid
In DepthDetails US Patent