BDBM2628 3-(7-methoxy-1-methyl-1H-indol-3-yl)-4-(1-methyl-1H-indol-3-yl)-2,5-dihydro-1H-pyrrole-2,5-dione::Bisindolylmaleimide deriv. 50
SMILES COc1cccc2c(cn(C)c12)C1=C(C(=O)NC1=O)c1cn(C)c2ccccc12
InChI Key InChIKey=NVHOOKQWWPYMRJ-UHFFFAOYSA-N
Data  1 IC50
  Tab Delimited (TSV)   2D SDfile   Computed 3D by Vconf -m prep SDfile
Find this compound or compounds like it in BindingDB:
Activity Spreadsheet -- Enzyme Inhibition Constant Data from BindingDB
Found 1 hit for monomerid = 2628
TargetProtein kinase C beta type(Rattus norvegicus (rat))
Roche Products
LigandPNGBDBM2628(3-(7-methoxy-1-methyl-1H-indol-3-yl)-4-(1-methyl-1...)
Affinity DataIC50:  1.00E+3nM. Assay description: The activity of PKC, activated by phosphatidylerine and Ca2+, is measured by its ability to transfer phosphate from [gamma-32P]ATP to lysine-rich his...
In DepthDetails ArticlePubMed