BDBM262832 3-[4-(7-azaspiro[3.5]non- 2-ylamino)cyclohexyl]-2- (1H-tetrazol-5-yl)-6- (trifluoromethyl)benzene sulfonamide::US9708336, 685
SMILES NS(=O)(=O)c1c(ccc([C@H]2CC[C@@H](CC2)NC2CC3(C2)CCNCC3)c1-c1nnn[nH]1)C(F)(F)F
InChI Key
Data  3 IC50
  Tab Delimited (TSV)   2D SDfile   Computed 3D by Vconf -m prep SDfile
Find this compound or compounds like it in BindingDB:
Activity Spreadsheet -- Enzyme Inhibition Constant Data from BindingDB
Found 3 hits for monomerid = 262832
TargetMetallo-beta-lactamase type 2(Serratia marcescens)
Merck Sharp & Dohme
US Patent
LigandPNGBDBM262832(3-[4-(7-azaspiro[3.5]non- 2-ylamino)cyclohexyl]-2-...)
Affinity DataIC50:  75.8nMpH: 7.0Assay Description:The Class B enzyme activities were measured in the presence of the test inhibitor in a fluorescence assay against a commercially available substrate ...
Ligand InfoPC cidPC sid
In DepthDetails US Patent
TargetVIM-1 metallo-beta-lactamase(Klebsiella pneumoniae)
Merck Sharp & Dohme
US Patent
LigandPNGBDBM262832(3-[4-(7-azaspiro[3.5]non- 2-ylamino)cyclohexyl]-2-...)
Affinity DataIC50:  4.88nMpH: 7.0Assay Description:The Class B enzyme activities were measured in the presence of the test inhibitor in a fluorescence assay against a commercially available substrate ...
Ligand InfoPC cidPC sid
In DepthDetails US Patent
TargetMetallo-beta-lactamase type 2(Klebsiella pneumoniae)
Merck Sharp & Dohme
US Patent
LigandPNGBDBM262832(3-[4-(7-azaspiro[3.5]non- 2-ylamino)cyclohexyl]-2-...)
Affinity DataIC50:  30nMpH: 7.0Assay Description:The Class B enzyme activities were measured in the presence of the test inhibitor in a fluorescence assay against a commercially available substrate ...
Ligand InfoPC cidPC sid
In DepthDetails US Patent