BDBM262873 3-[1-(methylamino)-2,3- dihydro-1H-inden-4-yl]-2-(1H- tetrazol-5-yl)-6- (trifluoromethyl)benzenesulfon- amide::US9708336, 726
SMILES CNC1CCc2c1cccc2-c1ccc(c(c1-c1nnn[nH]1)S(N)(=O)=O)C(F)(F)F
InChI Key
Data  3 IC50
  Tab Delimited (TSV)   2D SDfile   Computed 3D by Vconf -m prep SDfile
Find this compound or compounds like it in BindingDB:
Activity Spreadsheet -- Enzyme Inhibition Constant Data from BindingDB
Found 3 hits for monomerid = 262873
TargetMetallo-beta-lactamase type 2(Serratia marcescens)
Merck Sharp & Dohme
US Patent
LigandPNGBDBM262873(3-[1-(methylamino)-2,3- dihydro-1H-inden-4-yl]-2-(...)
Affinity DataIC50:  58.9nMpH: 7.0Assay Description:The Class B enzyme activities were measured in the presence of the test inhibitor in a fluorescence assay against a commercially available substrate ...
Ligand InfoPC cidPC sid
In DepthDetails US Patent
TargetVIM-1 metallo-beta-lactamase(Klebsiella pneumoniae)
Merck Sharp & Dohme
US Patent
LigandPNGBDBM262873(3-[1-(methylamino)-2,3- dihydro-1H-inden-4-yl]-2-(...)
Affinity DataIC50:  1.21nMpH: 7.0Assay Description:The Class B enzyme activities were measured in the presence of the test inhibitor in a fluorescence assay against a commercially available substrate ...
Ligand InfoPC cidPC sid
In DepthDetails US Patent
TargetMetallo-beta-lactamase type 2(Klebsiella pneumoniae)
Merck Sharp & Dohme
US Patent
LigandPNGBDBM262873(3-[1-(methylamino)-2,3- dihydro-1H-inden-4-yl]-2-(...)
Affinity DataIC50:  26.8nMpH: 7.0Assay Description:The Class B enzyme activities were measured in the presence of the test inhibitor in a fluorescence assay against a commercially available substrate ...
Ligand InfoPC cidPC sid
In DepthDetails US Patent