BDBM262881 3'-(2-aminoethyl)-2-(1H- tetraozl-5-yl)-4- (trifluoromethyl)biphenyl-3- sulfonamide::US9708336, 734
SMILES NCCc1cccc(c1)-c1ccc(c(c1-c1nnn[nH]1)S(N)(=O)=O)C(F)(F)F
InChI Key InChIKey=YMBLPLXXWOGLAR-UHFFFAOYSA-N
Data  3 IC50
  Tab Delimited (TSV)   2D SDfile   Computed 3D by Vconf -m prep SDfile
Find this compound or compounds like it in BindingDB:
Activity Spreadsheet -- Enzyme Inhibition Constant Data from BindingDB
Found 3 hits for monomerid = 262881
TargetMetallo-beta-lactamase type 2(Serratia marcescens)
Merck Sharp & Dohme
US Patent
LigandPNGBDBM262881(3'-(2-aminoethyl)-2-(1H- tetraozl-5-yl)-4- (triflu...)
Affinity DataIC50:  34.4nMpH: 7.0Assay Description:The Class B enzyme activities were measured in the presence of the test inhibitor in a fluorescence assay against a commercially available substrate ...
Ligand InfoPC cidPC sid
In DepthDetails US Patent
TargetVIM-1 metallo-beta-lactamase(Klebsiella pneumoniae)
Merck Sharp & Dohme
US Patent
LigandPNGBDBM262881(3'-(2-aminoethyl)-2-(1H- tetraozl-5-yl)-4- (triflu...)
Affinity DataIC50:  3.27nMpH: 7.0Assay Description:The Class B enzyme activities were measured in the presence of the test inhibitor in a fluorescence assay against a commercially available substrate ...
Ligand InfoPC cidPC sid
In DepthDetails US Patent
TargetMetallo-beta-lactamase type 2(Klebsiella pneumoniae)
Merck Sharp & Dohme
US Patent
LigandPNGBDBM262881(3'-(2-aminoethyl)-2-(1H- tetraozl-5-yl)-4- (triflu...)
Affinity DataIC50:  31.4nMpH: 7.0Assay Description:The Class B enzyme activities were measured in the presence of the test inhibitor in a fluorescence assay against a commercially available substrate ...
Ligand InfoPC cidPC sid
In DepthDetails US Patent