BDBM262882 4'-(3-aminopropyl)-2-(1H- tetrazol-5-yl)-4- (trifluoromethyl)biphenyl-3- sulfonamide::US9708336, 735
SMILES NCCCc1ccc(cc1)-c1ccc(c(c1-c1nnn[nH]1)S(N)(=O)=O)C(F)(F)F
InChI Key InChIKey=OHKZNDHULZZGHC-UHFFFAOYSA-N
Data  3 IC50
  Tab Delimited (TSV)   2D SDfile   Computed 3D by Vconf -m prep SDfile
Find this compound or compounds like it in BindingDB:
Activity Spreadsheet -- Enzyme Inhibition Constant Data from BindingDB
Found 3 hits for monomerid = 262882
TargetMetallo-beta-lactamase type 2(Serratia marcescens)
Merck Sharp & Dohme
US Patent
LigandPNGBDBM262882(4'-(3-aminopropyl)-2-(1H- tetrazol-5-yl)-4- (trifl...)
Affinity DataIC50:  1.70nMpH: 7.0Assay Description:The Class B enzyme activities were measured in the presence of the test inhibitor in a fluorescence assay against a commercially available substrate ...
Ligand InfoPC cidPC sid
In DepthDetails US Patent
TargetVIM-1 metallo-beta-lactamase(Klebsiella pneumoniae)
Merck Sharp & Dohme
US Patent
LigandPNGBDBM262882(4'-(3-aminopropyl)-2-(1H- tetrazol-5-yl)-4- (trifl...)
Affinity DataIC50:  0.388nMpH: 7.0Assay Description:The Class B enzyme activities were measured in the presence of the test inhibitor in a fluorescence assay against a commercially available substrate ...
Ligand InfoPC cidPC sid
In DepthDetails US Patent
TargetMetallo-beta-lactamase type 2(Klebsiella pneumoniae)
Merck Sharp & Dohme
US Patent
LigandPNGBDBM262882(4'-(3-aminopropyl)-2-(1H- tetrazol-5-yl)-4- (trifl...)
Affinity DataIC50:  3.03nMpH: 7.0Assay Description:The Class B enzyme activities were measured in the presence of the test inhibitor in a fluorescence assay against a commercially available substrate ...
Ligand InfoPC cidPC sid
In DepthDetails US Patent