BDBM262994 (R)-2-amino-4-methyl-N—((S)-5-methyl-5H-chromeno[3,4-c]pyridin-8-yl)pentanamide::US9708337, 7
SMILES CC(C)C[C@@H](N)C(=O)Nc1ccc-2c(O[C@H](C)c3cnccc-23)c1
InChI Key InChIKey=NMIOFFIGOXMLIA-SJKOYZFVSA-N
Data  1 IC50
  Tab Delimited (TSV)   2D SDfile   Computed 3D by Vconf -m prep SDfile
Find this compound or compounds like it in BindingDB:
Activity Spreadsheet -- Enzyme Inhibition Constant Data from BindingDB
Found 1 hit for monomerid = 262994
TargetAP2-associated protein kinase 1(Homo sapiens (Human))
Bristol-Myers Squibb
US Patent
LigandPNGBDBM262994((R)-2-amino-4-methyl-N—((S)-5-methyl-5H-chrom...)
Affinity DataIC50:  55nMpH: 7.4 T: 2°C. Assay description: The assays were performed in U-bottom 384-well plates. The final assay volume was 30 μl prepared from 15 μl additions of enzyme and substra...
Ligand InfoPC cidPC sid
In DepthDetails US Patent