BDBM263033 US9708340, 10
SMILES OC(=O)[C@H]1CCCN1C(=O)Nc1cc(Cl)ccc1-c1ccccc1
InChI Key InChIKey=BOZWSAAWFASNST-MRXNPFEDSA-N
Data  2 IC50
  Tab Delimited (TSV)   2D SDfile   Computed 3D by Vconf -m prep SDfile
Find this compound or compounds like it in BindingDB:
Activity Spreadsheet -- Enzyme Inhibition Constant Data from BindingDB
Found 2 hits for monomerid = 263033
TargetFatty acid-binding protein 5(Homo sapiens (Human))
Hoffmann-La Roche
US Patent
LigandPNGBDBM263033(US9708340, 10)
Affinity DataIC50: >1.44E+3nM
Ligand InfoPC cidPC sid
In DepthDetails US Patent
TargetFatty acid-binding protein, adipocyte(Homo sapiens (Human))
Hoffmann-La Roche
US Patent
LigandPNGBDBM263033(US9708340, 10)
Affinity DataIC50:  120nMpH: 7.5 T: 2°C. Assay description: Compounds were profiled for activity against human FABP4 (huFABP4) and/or human FABP5 (huFABP5) in Terbium (Tb) time resolved-fluorescence energy tra...
Ligand InfoPC cidPC sid
In DepthDetails US Patent