BDBM26304 4-aminopyrazole quinazoline, 4::N-(2,3-difluorophenyl)-2-{4-[(7-{3-[ethyl(2-hydroxyethyl)amino]propoxy}-6-methoxyquinazolin-4-yl)amino]-1H-pyrazol-1-yl}acetamide
SMILES CCN(CCO)CCCOc1cc2ncnc(Nc3cnn(CC(=O)Nc4cccc(F)c4F)c3)c2cc1OC
InChI Key InChIKey=NYOGIGBHKYKOEE-UHFFFAOYSA-N
Data  2 KI
  Tab Delimited (TSV)   2D SDfile   Computed 3D by Vconf -m prep SDfile
Find this compound or compounds like it in BindingDB:
Activity Spreadsheet -- Enzyme Inhibition Constant Data from BindingDB
Found 2 hits for monomerid = 26304
TargetAurora kinase B(Homo sapiens (Human))
Astrazeneca
LigandPNGBDBM26304(4-aminopyrazole quinazoline, 4 | N-(2,3-difluoroph...)
Affinity DataKi: <1nM ΔG°: <-12.1kcal/molepH: 7.5 T: 2°C. Assay description: In vitro kinase assay using recombinant Aurora B bound to INCENP was incubated at room temperature with substrate, and test compounds in the presence...
In DepthDetails ArticlePubMed
TargetAurora kinase A(Homo sapiens (Human))
Astrazeneca
LigandPNGBDBM26304(4-aminopyrazole quinazoline, 4 | N-(2,3-difluoroph...)
Affinity DataKi:  540nM ΔG°:  -8.46kcal/molepH: 7.5 T: 2°C. Assay description: In vitro kinase assay using recombinant Aurora A purified from Sf9 cells was incubated at room temperature with substrate, and test compounds in the ...
In DepthDetails ArticlePubMed