BDBM263075 US9708359, 4
SMILES CCCCCCCCCCCCCCCCOCCC(=O)OC[C@H]1O[C@H]([C@H](O)[C@@H]1O)n1cc(C(N)=O)c2c(N)nc(C)nc12
InChI Key InChIKey=VCXDQBGJKPJMHV-SLXDEKLDSA-N
Data  1 EC50
  Tab Delimited (TSV)   2D SDfile   Computed 3D by Vconf -m prep SDfile
Find this compound or compounds like it in BindingDB:
Activity Spreadsheet -- Enzyme Inhibition Constant Data from BindingDB
Found 1 hit for monomerid = 263075
TargetGenome polyprotein(Murine norovirus 1)
Chimerix
US Patent
LigandPNGBDBM263075(US9708359, 4)
Affinity DataEC50:  3.50E+3nM. Assay description: Polymerase reactions (10 μL) were conducted for 60 minutes at 37° C. Nucleoside triphosphates (NTPs) were present at 100 μM each, with 0.05...
Ligand InfoPC cidPC sid
In DepthDetails US Patent