BDBM263177 US9708359, 15
SMILES NC(=O)c1cn([C@@H]2O[C@H](CO)[C@@H](O)[C@H]2O)c2nc(nc(N)c12)-c1ccccc1
InChI Key InChIKey=ZEGNCYPZXFNSEK-IPKTUIKJSA-N
Data  1 EC50
  Tab Delimited (TSV)   2D SDfile   Computed 3D by Vconf -m prep SDfile
Find this compound or compounds like it in BindingDB:
Activity Spreadsheet -- Enzyme Inhibition Constant Data from BindingDB
Found 1 hit for monomerid = 263177
TargetGenome polyprotein(Murine norovirus 1)
Chimerix
US Patent
LigandPNGBDBM263177(US9708359, 15)
Affinity DataEC50: >1.00E+5nM. Assay description: Polymerase reactions (10 μL) were conducted for 60 minutes at 37° C. Nucleoside triphosphates (NTPs) were present at 100 μM each, with 0.05...
Ligand InfoPC cidPC sid
In DepthDetails US Patent