BDBM263254 US9708370, 65 CP-AP-5
SMILES C[C@H](NC(=O)N1CCCN1C(=O)[C@@H](N)Cc1cnc[nH]1)C(=O)N[C@@H](Cc1cc2ccccc2[nH]1)C(=O)N[C@H](Cc1ccccc1)C(=O)N[C@@H](CCCCN)C(N)=O
InChI Key
Data  1 IC50
  Tab Delimited (TSV)   2D SDfile   Computed 3D by Vconf -m prep SDfile
Find this compound or compounds like it in BindingDB:
Activity Spreadsheet -- Enzyme Inhibition Constant Data from BindingDB
Found 1 hit for monomerid = 263254
TargetEstrogen receptor [D538G](Homo sapiens (Human))
Valorisation-Recherche, Limited Partnership
US Patent
LigandPNGBDBM263254(US9708370, 65 CP-AP-5)
Affinity DataIC50:  1.00E+4nM. Assay description: GHS-R1a radioreceptor assay using LLCPK-1 membranes overexpressing GSH-R1a and radioiodinated (1-28) rat ghrelin as tracer.
Ligand InfoPC cidPC sid
In DepthDetails US Patent