BDBM263310 3-cyclopropyl-1-(4-[1,2,3]triazol-1-ylmethyl-benzyl)-1h-pyrazole-4-carboxylicacid (1-amino-isoquinolin-6-ylmethyl)-amide::US9533987, example 91
SMILES Nc1nccc2cc(CNC(=O)c3cn(Cc4ccc(Cn5ccnn5)cc4)nc3C3CC3)ccc12
InChI Key InChIKey=DYRPOBCRRDNPMT-UHFFFAOYSA-N
Data  2 IC50
  Tab Delimited (TSV)   2D SDfile   Computed 3D by Vconf -m prep SDfile
Find this compound or compounds like it in BindingDB:
Activity Spreadsheet -- Enzyme Inhibition Constant Data from BindingDB
Found 2 hits for monomerid = 263310
TargetKallikrein-1(Homo sapiens (Human))
Kalvista Pharmaceuticals
US Patent
LigandPNGBDBM263310(3-cyclopropyl-1-(4-[1,2,3]triazol-1-ylmethyl-benzy...)
Affinity DataIC50: >1.00E+4nM. Assay description: Human serine protease enzymes plasmin, thrombin, trypsin, Factor Xa and Factor XIIa were assayed for enzymatic activity using an appropriate fluoroge...
Ligand InfoPC cidPC sid
In DepthDetails US Patent
TargetPlasma kallikrein(Homo sapiens (Human))
Kalvista Pharmaceuticals
US Patent
LigandPNGBDBM263310(3-cyclopropyl-1-(4-[1,2,3]triazol-1-ylmethyl-benzy...)
Affinity DataIC50:  13.8nM. Assay description: Plasma kallikrein inhibitory activity in vitro was determined using standard published methods (see e.g. Johansen et al., Int. J. Tiss. Reac. 1986, 8...
Ligand InfoPC cidPC sid
In DepthDetails US Patent