BDBM26336 6-[(2-aminoethyl)amino]-3-[(4-ethylphenyl)methyl]-1-[(4-methoxyphenyl)methyl]-1,2,3,4-tetrahydro-1,3,5-triazine-2,4-dione::Triazine compound, 2
SMILES CCc1ccc(Cn2c(=O)nc(NCCN)n(Cc3ccc(OC)cc3)c2=O)cc1
InChI Key InChIKey=SBCYNSAHFDNMMM-UHFFFAOYSA-N
Data  2 KI
  Tab Delimited (TSV)   2D SDfile   Computed 3D by Vconf -m prep SDfile
Find this compound or compounds like it in BindingDB:
Activity Spreadsheet -- Enzyme Inhibition Constant Data from BindingDB
Found 2 hits for monomerid = 26336
TargetProkineticin receptor 1(Homo sapiens (Human))
University Of Ferrara
LigandPNGBDBM26336(6-[(2-aminoethyl)amino]-3-[(4-ethylphenyl)methyl]-...)
Affinity DataKi:  440nM ΔG°:  -9.01kcal/molepH: 7.4 T: 2°C. Assay description: Nonspecific binding was determined in the presence of 1 uM Bv8. Displacement curves were determined in triplicate. The inhibition constant (Ki) of th...
In DepthDetails ArticlePubMed
TargetProkineticin receptor 2(Homo sapiens (Human))
University Of Ferrara
LigandPNGBDBM26336(6-[(2-aminoethyl)amino]-3-[(4-ethylphenyl)methyl]-...)
Affinity DataKi:  2.34E+4nM ΔG°:  -6.57kcal/molepH: 7.4 T: 2°C. Assay description: Nonspecific binding was determined in the presence of 1 uM Bv8. Displacement curves were determined in triplicate. The inhibition constant (Ki) of th...
In DepthDetails ArticlePubMed