BDBM263662 2-(tert-butyl)-4-chloro-5-((4-(diisopropylfluorosilyl)benzyl)oxy)pyridazin-3(2H)-one::US9713651, 62D
SMILES CC(C)[Si](F)(C(C)C)c1ccc(COc2cnn(c(=O)c2Cl)C(C)(C)C)cc1
InChI Key InChIKey=UMNFLAUFQMXCFK-UHFFFAOYSA-N
Data  1 IC50
  Tab Delimited (TSV)   2D SDfile   Computed 3D by Vconf -m prep SDfile
Find this compound or compounds like it in BindingDB:
Activity Spreadsheet -- Enzyme Inhibition Constant Data from BindingDB
Found 1 hit for monomerid = 263662
TargetNADH dehydrogenase [ubiquinone] flavoprotein 1, mitochondrial(Bos taurus)
Lantheus Medical Imaging
US Patent
LigandPNGBDBM263662(2-(tert-butyl)-4-chloro-5-((4-(diisopropylfluorosi...)
Affinity DataIC50: >1.00E+3nMpH: 7.4Assay Description:The procedure for determining catalytic activity of submitochondrial particles was adapted from Satoh et al. (e.g., see Satoh T, Miyoshi H, Sakamoto ...
Ligand InfoPC cidPC sid
In DepthDetails US Patent