BDBM263674 US9714221, Example 11
SMILES Oc1ccc(cc1)C1=C(c2ccc(O[C@H]3CCN(CCCF)C3)cc2)c2ccc(O)cc2CCC1
InChI Key InChIKey=KQTVBMTWQANQJC-MHZLTWQESA-N
Data  3 IC50  1 EC50
  Tab Delimited (TSV)   2D SDfile   Computed 3D by Vconf -m prep SDfile
Find this compound or compounds like it in BindingDB:
Activity Spreadsheet -- Enzyme Inhibition Constant Data from BindingDB
Found 4 hits for monomerid = 263674
TargetEstrogen receptor(Homo sapiens (Human))
Sanofi
US Patent
LigandPNGBDBM263674(US9714221, Example 11)
Affinity DataIC50:  2nMpH: 7.4 T: 2°C. Assay description: It is a competition assay, where binding of a test compound to a complex comprised of (i) His6-ERα298-554 protein representing ERα ligand-b...
Ligand InfoPC cidPC sid
In DepthDetails US Patent
TargetEstrogen receptor(Homo sapiens (Human))
Sanofi
US Patent
LigandPNGBDBM263674(US9714221, Example 11)
Affinity DataEC50:  0.700nM. Assay description: Induction of ERalpha degradation in human MCF7 cells incubated for 4 hrs by Alexafluor-488 conjugate anti-rabbit antibody/Syto-64 staining based immu...
Ligand InfoPC cidPC sid
In DepthDetails ArticlePubMed
TargetEstrogen receptor [Y537S](Homo sapiens (Human))
Sanofi
US Patent
LigandPNGBDBM263674(US9714221, Example 11)
Affinity DataIC50:  3nMpH: 7.4 T: 2°C. Assay description: It is a competition assay, where binding of a test compound to a complex comprised of (i) His6-ERα298-554 protein representing ERα ligand-b...
Ligand InfoPC cidPC sid
In DepthDetails US Patent
TargetEstrogen receptor [D538G](Homo sapiens (Human))
Sanofi
US Patent
LigandPNGBDBM263674(US9714221, Example 11)
Affinity DataIC50:  4nMpH: 7.4 T: 2°C. Assay description: It is a competition assay, where binding of a test compound to a complex comprised of (i) His6-ERα298-554 protein representing ERα ligand-b...
Ligand InfoPC cidPC sid
In DepthDetails US Patent