BDBM263710 6-(2,4- dichloro- phenyl)-1- fluoro-5-[4- [(3S)-1-(3- fluoropropyl)- pyrrolidin-3- yl]oxy- phenyl]-8,9- dihydro- 7H- benzo[7]- annulen-2-ol6-(2-fluoro- 4-methyl- phenyl)-5- [4-[(3S)-1-(3- fluoropropyl)- pyrrolidin-3- yl]oxy- phenyl]-8,9- dihydro- 7H- benzo[7]- annulene-2- carboxylic acid::US9714221, Example 47
SMILES Oc1ccc2c(CCCC(c3ccc(Cl)cc3Cl)=C2c2ccc(O[C@H]3CCN(CCCF)C3)cc2)c1F
InChI Key InChIKey=OGLHZCIYFPJVBD-QFIPXVFZSA-N
Data  3 IC50
  Tab Delimited (TSV)   2D SDfile   Computed 3D by Vconf -m prep SDfile
Find this compound or compounds like it in BindingDB:
Activity Spreadsheet -- Enzyme Inhibition Constant Data from BindingDB
Found 3 hits for monomerid = 263710
TargetEstrogen receptor(Homo sapiens (Human))
Sanofi
US Patent
LigandPNGBDBM263710(6-(2,4- dichloro- phenyl)-1- fluoro-5-[4- [(3S)-1-...)
Affinity DataIC50:  2nMpH: 7.4 T: 2°C. Assay description: It is a competition assay, where binding of a test compound to a complex comprised of (i) His6-ERα298-554 protein representing ERα ligand-b...
Ligand InfoPC cidPC sid
In DepthDetails US Patent
TargetEstrogen receptor [Y537S](Homo sapiens (Human))
Sanofi
US Patent
LigandPNGBDBM263710(6-(2,4- dichloro- phenyl)-1- fluoro-5-[4- [(3S)-1-...)
Affinity DataIC50:  23nMpH: 7.4 T: 2°C. Assay description: It is a competition assay, where binding of a test compound to a complex comprised of (i) His6-ERα298-554 protein representing ERα ligand-b...
Ligand InfoPC cidPC sid
In DepthDetails US Patent
TargetEstrogen receptor [D538G](Homo sapiens (Human))
Sanofi
US Patent
LigandPNGBDBM263710(6-(2,4- dichloro- phenyl)-1- fluoro-5-[4- [(3S)-1-...)
Affinity DataIC50:  31nMpH: 7.4 T: 2°C. Assay description: It is a competition assay, where binding of a test compound to a complex comprised of (i) His6-ERα298-554 protein representing ERα ligand-b...
Ligand InfoPC cidPC sid
In DepthDetails US Patent