BDBM263925 US9714224, 34
SMILES OC(=O)[C@@H]1Cc2c(CN1C(=O)C(c1ccccc1)c1ccccc1)ccc(O)c2OCc1ccccc1
InChI Key InChIKey=KMTMGMCEWVFGGJ-SANMLTNESA-N
Data  1 IC50
  Tab Delimited (TSV)   2D SDfile   Computed 3D by Vconf -m prep SDfile
Find this compound or compounds like it in BindingDB:
Activity Spreadsheet -- Enzyme Inhibition Constant Data from BindingDB
Found 1 hit for monomerid = 263925
TargetType-2 angiotensin II receptor(Homo sapiens (Human))
Novartis
US Patent
LigandPNGBDBM263925(US9714224, 34)
Affinity DataIC50:  33.5nM. Assay description: 120 μL membrane (5 mg protein/well) was incubated with 15 μL of [125I]-CGP42112A and 15 μL of compound at RT for 1.5 hrs. The binding ...
Ligand InfoPC cidPC sid
In DepthDetails US Patent