BDBM263966 2-(5-methyl-1H-pyrazol-1- yl)isonicotinic acid::US10173996, Example 31::US9604961, Example 31::US9714230, 31::US9908865, Example 31
SMILES Cc1ccnn1-c1cc(ccn1)C(O)=O
InChI Key InChIKey=DBNRSQHWQKIXGR-UHFFFAOYSA-N
Data  3 IC50
  Tab Delimited (TSV)   2D SDfile   Computed 3D by Vconf -m prep SDfile
Find this compound or compounds like it in BindingDB:
Activity Spreadsheet -- Enzyme Inhibition Constant Data from BindingDB
Found 3 hits for monomerid = 263966
TargetLysine-specific demethylase 5A(Homo sapiens (Human))
Celgene Quanticel Research
US Patent
LigandPNGBDBM263966(2-(5-methyl-1H-pyrazol-1- yl)isonicotinic acid | U...)
Affinity DataIC50:  5.50E+3nM. Assay description: The enzymatic assay of Jarid1A activity is based upon Time Resolved-Fluorescence Resonance Energy Transfer (TR-FRET) detection. The ability of test c...
Ligand InfoPC cidPC sid
In DepthDetails US Patent
TargetLysine-specific demethylase 4C(Homo sapiens (Human))
Celgene Quanticel Research
US Patent
LigandPNGBDBM263966(2-(5-methyl-1H-pyrazol-1- yl)isonicotinic acid | U...)
Affinity DataIC50:  550nM. Assay description: The ability of test compounds to inhibit the activity of JMJD2C was determined in 384-well plate format under the following reaction conditions: 0.3 ...
Ligand InfoPC cidPC sid
In DepthDetails US Patent
TargetLysine-specific demethylase 5B(Homo sapiens (Human))
Celgene Quanticel Research
US Patent
LigandPNGBDBM263966(2-(5-methyl-1H-pyrazol-1- yl)isonicotinic acid | U...)
Affinity DataIC50:  5.50E+3nM. Assay description: The ability of test compounds to inhibit the activity of Jarid1B was determined in 384-well plate format under the following reaction conditions: 0.8...
Ligand InfoPC cidPC sid
In DepthDetails US Patent