BDBM264038 2-[5-(2,3-dihydro-1-benzofuran-7- ylmethoxy)pyrazol-1-yl]pyridine- 4-carboxylic acid::US10173996, Example 123::US9604961, Example 123::US9714230, 123::US9908865, Example 123
SMILES OC(=O)c1ccnc(c1)-n1nccc1OCc1cccc2CCOc12
InChI Key InChIKey=ILTCPDIVBYUMLZ-UHFFFAOYSA-N
Data  3 IC50
  Tab Delimited (TSV)   2D SDfile   Computed 3D by Vconf -m prep SDfile
Find this compound or compounds like it in BindingDB:
Activity Spreadsheet -- Enzyme Inhibition Constant Data from BindingDB
Found 3 hits for monomerid = 264038
TargetLysine-specific demethylase 5A(Homo sapiens (Human))
Celgene Quanticel Research
US Patent
LigandPNGBDBM264038(2-[5-(2,3-dihydro-1-benzofuran-7- ylmethoxy)pyrazo...)
Affinity DataIC50: <100nM. Assay description: The enzymatic assay of Jarid1A activity is based upon Time Resolved-Fluorescence Resonance Energy Transfer (TR-FRET) detection. The ability of test c...
Ligand InfoPC cidPC sid
In DepthDetails US Patent
TargetLysine-specific demethylase 4C(Homo sapiens (Human))
Celgene Quanticel Research
US Patent
LigandPNGBDBM264038(2-[5-(2,3-dihydro-1-benzofuran-7- ylmethoxy)pyrazo...)
Affinity DataIC50:  550nM. Assay description: The ability of test compounds to inhibit the activity of JMJD2C was determined in 384-well plate format under the following reaction conditions: 0.3 ...
Ligand InfoPC cidPC sid
In DepthDetails US Patent
TargetLysine-specific demethylase 5B(Homo sapiens (Human))
Celgene Quanticel Research
US Patent
LigandPNGBDBM264038(2-[5-(2,3-dihydro-1-benzofuran-7- ylmethoxy)pyrazo...)
Affinity DataIC50: <100nM. Assay description: The ability of test compounds to inhibit the activity of Jarid1B was determined in 384-well plate format under the following reaction conditions: 0.8...
Ligand InfoPC cidPC sid
In DepthDetails US Patent