BDBM264101 3-(5-(4-(4-(2-oxopyridin-1(2H)-yl)phenyl)piperazin-1-yl)pentyl)-1H-indole-5-carbonitrile::US9714232, 14
SMILES O=c1ccccn1-c1ccc(cc1)N1CCN(CCCCCc2c[nH]c3ccc(cc23)C#N)CC1
InChI Key InChIKey=ZHICSWRSHPZEDK-UHFFFAOYSA-N
Data  1 KI  2 IC50
  Tab Delimited (TSV)   2D SDfile   Computed 3D by Vconf -m prep SDfile
Find this compound or compounds like it in BindingDB:
Activity Spreadsheet -- Enzyme Inhibition Constant Data from BindingDB
Found 3 hits for monomerid = 264101
Target5-hydroxytryptamine receptor 1A(Homo sapiens (Human))
Sunshine Lake Pharma
US Patent
LigandPNGBDBM264101(3-(5-(4-(4-(2-oxopyridin-1(2H)-yl)phenyl)piperazin...)
Affinity DataKi:  4.10nMpH: 7.4Assay Description:Human HEK-293 cell homogenates (36 μg protein) were incubated at 22° C. for 60 minutes with 0.3 nM [3H]8-0H-DPAT (Perkin-Elmer) in the absence o...
Ligand InfoPC cidPC sid
In DepthDetails US Patent
TargetSodium-dependent serotonin transporter(Rattus norvegicus (rat))
Sunshine Lake Pharma
Curated by ChEMBL
LigandPNGBDBM264101(3-(5-(4-(4-(2-oxopyridin-1(2H)-yl)phenyl)piperazin...)
Affinity DataIC50:  1.40nM. Assay description: Inhibition of serotonin transporter expressed in rat brain tissue assessed as inhibition of [3H]-5-hydroxytryptamine reuptake measured after 15 mins ...
Ligand InfoPC cidPC sid
In DepthDetails ArticlePubMed
Target5-hydroxytryptamine receptor 1A(Rattus norvegicus (rat))
Sunshine Lake Pharma
US Patent
LigandPNGBDBM264101(3-(5-(4-(4-(2-oxopyridin-1(2H)-yl)phenyl)piperazin...)
Affinity DataIC50:  1.40nMpH: 7.4Assay Description:The synaptosomes (150 μg) prepared from a rat brain were incubated at 37° C. for 15 minutes with 0.1 μCi [3H]5-HT in the absence or presenc...
Ligand InfoPC cidPC sid
In DepthDetails US Patent