BDBM264133 (Z)-4-((3-Bromo-2-chlorophenyl)imino)-1-methyl-1H-benzo[d][1,3]oxazin-2(4H)-one::US9714234, 8
SMILES Cn1c2ccccc2\c(=N\c2cccc(Br)c2Cl)oc1=O
InChI Key InChIKey=PWRMJJZKENGOPR-JXAWBTAJSA-N
Data  2 IC50
  Tab Delimited (TSV)   2D SDfile   Computed 3D by Vconf -m prep SDfile
Find this compound or compounds like it in BindingDB:
Activity Spreadsheet -- Enzyme Inhibition Constant Data from BindingDB
Found 2 hits for monomerid = 264133
TargetTyrosine-protein kinase JAK2(Homo sapiens (Human))
Bristol-Myers Squibb
US Patent
LigandPNGBDBM264133((Z)-4-((3-Bromo-2-chlorophenyl)imino)-1-methyl-1H-...)
Affinity DataIC50:  2.20E+3nMpH: 7.4 T: 2°C. Assay description: Compounds with activity against Jak2 tyrosine kinase have been observed to cause thrombocytopenia, anemia and neutropenia in human patients in clinic...
Ligand InfoPC cidPC sid
In DepthDetails US Patent
TargetTyrosine-protein kinase BTK(Homo sapiens (Human))
Bristol-Myers Squibb
US Patent
LigandPNGBDBM264133((Z)-4-((3-Bromo-2-chlorophenyl)imino)-1-methyl-1H-...)
Affinity DataIC50:  5.80nMpH: 7.4 T: 2°C. Assay description: To V-bottom 384-well plates were added test compounds, human recombinant Btk (1 nM, INVITROGEN Corporation), fluoresceinated peptide (1.5 μM), A...
Ligand InfoPC cidPC sid
In DepthDetails US Patent