BDBM264138 5-Chloro-2-(2-methyl-3-(4,4,5,5-tetramethyl-1,3,2-dioxaborolan-2-yl)phenyl)-1H-pyrido[1,2-c]pyrimidine-1,3(2H)-dione(racemic)::US9714234, 13
SMILES Cc1c(cccc1-n1c(=O)cc2c(Cl)cccn2c1=O)B1OC(C)(C)C(C)(C)O1
InChI Key InChIKey=AGWUIWSSBYPLBJ-UHFFFAOYSA-N
Data  2 IC50
  Tab Delimited (TSV)   2D SDfile   Computed 3D by Vconf -m prep SDfile
Find this compound or compounds like it in BindingDB:
Activity Spreadsheet -- Enzyme Inhibition Constant Data from BindingDB
Found 2 hits for monomerid = 264138
TargetTyrosine-protein kinase JAK2(Homo sapiens (Human))
Bristol-Myers Squibb
US Patent
LigandPNGBDBM264138(5-Chloro-2-(2-methyl-3-(4,4,5,5-tetramethyl-1,3,2-...)
Affinity DataIC50:  1.30E+3nMpH: 7.4 T: 2°C. Assay description: Compounds with activity against Jak2 tyrosine kinase have been observed to cause thrombocytopenia, anemia and neutropenia in human patients in clinic...
Ligand InfoPC cidPC sid
In DepthDetails US Patent
TargetTyrosine-protein kinase BTK(Homo sapiens (Human))
Bristol-Myers Squibb
US Patent
LigandPNGBDBM264138(5-Chloro-2-(2-methyl-3-(4,4,5,5-tetramethyl-1,3,2-...)
Affinity DataIC50:  0.940nMpH: 7.4 T: 2°C. Assay description: To V-bottom 384-well plates were added test compounds, human recombinant Btk (1 nM, INVITROGEN Corporation), fluoresceinated peptide (1.5 μM), A...
Ligand InfoPC cidPC sid
In DepthDetails US Patent