BDBM264150 4-(3-(S)-(8-Fluoro-1-methyl-2,4-dioxo-1,2-dihydroquinazolin-3(4H)-yl)-2-methylphenyl)-7-(2-hydroxypropan-2-yl)-5-methyl-9H-carbazole-1-carboxamide (Single diastereomer)::US9714234, 25
SMILES Cc1cc(cc2[nH]c3c(ccc(-c4cccc(c4C)-n4c(=O)n(C)c5c(F)cccc5c4=O)c3c12)C(N)=O)C(C)(C)O
InChI Key InChIKey=BEVUBRZINAWGDH-UHFFFAOYSA-N
Data  2 IC50
  Tab Delimited (TSV)   2D SDfile   Computed 3D by Vconf -m prep SDfile
Find this compound or compounds like it in BindingDB:
Activity Spreadsheet -- Enzyme Inhibition Constant Data from BindingDB
Found 2 hits for monomerid = 264150
TargetTyrosine-protein kinase JAK2(Homo sapiens (Human))
Bristol-Myers Squibb
US Patent
LigandPNGBDBM264150(4-(3-(S)-(8-Fluoro-1-methyl-2,4-dioxo-1,2-dihydroq...)
Affinity DataIC50:  4.60E+3nMpH: 7.4 T: 2°C. Assay description: Compounds with activity against Jak2 tyrosine kinase have been observed to cause thrombocytopenia, anemia and neutropenia in human patients in clinic...
Ligand InfoPC cidPC sid
In DepthDetails US Patent
TargetTyrosine-protein kinase BTK(Homo sapiens (Human))
Bristol-Myers Squibb
US Patent
LigandPNGBDBM264150(4-(3-(S)-(8-Fluoro-1-methyl-2,4-dioxo-1,2-dihydroq...)
Affinity DataIC50:  0.700nMpH: 7.4 T: 2°C. Assay description: To V-bottom 384-well plates were added test compounds, human recombinant Btk (1 nM, INVITROGEN Corporation), fluoresceinated peptide (1.5 μM), A...
Ligand InfoPC cidPC sid
In DepthDetails US Patent