BDBM264219 (2R)-N-(3-{2-[(3- ethoxy-1-methyl-1H- pyrazol-4-yl)amino]-5- fluoropyrimidin-4-yl}- 1H-indol-7-yl)-2- (4-methylpiperazin-1- yl)propanamide::US10167276, Example 39::US10654835, Example 39::US11247983, Example 39::US9714236, 39
SMILES CCOc1nn(C)cc1Nc1ncc(F)c(n1)-c1c[nH]c2c(NC(=O)[C@@H](C)N3CCN(C)CC3)cccc12
InChI Key
Data  12 IC50
  Tab Delimited (TSV)   2D SDfile   Computed 3D by Vconf -m prep SDfile
Find this compound or compounds like it in BindingDB:
Activity Spreadsheet -- Enzyme Inhibition Constant Data from BindingDB
Found 12 hits for monomerid = 264219
TargetTyrosine-protein kinase JAK1 [866-1154](Homo sapiens (Human))
Astrazeneca
US Patent
LigandPNGBDBM264219((2R)-N-(3-{2-[(3- ethoxy-1-methyl-1H- pyrazol-4-yl...)
Affinity DataIC50:  55nMpH: 7.3Assay Description:Enzyme inhibition studies were performed using recombinant JAK1 (amino acids 866-1154, Life Technologies, #PV4774, Carlsbad, Calif.), JAK2 (amino aci...
Ligand InfoPC cidPC sid
In DepthDetails US Patent
TargetTyrosine-protein kinase JAK2 [831-1132](Homo sapiens (Human))
Astrazeneca
US Patent
LigandPNGBDBM264219((2R)-N-(3-{2-[(3- ethoxy-1-methyl-1H- pyrazol-4-yl...)
Affinity DataIC50:  2.55E+4nMpH: 7.3Assay Description:Enzyme inhibition studies were performed using recombinant JAK1 (amino acids 866-1154, Life Technologies, #PV4774, Carlsbad, Calif.), JAK2 (amino aci...
Ligand InfoPC cidPC sid
In DepthDetails US Patent
TargetTyrosine-protein kinase JAK3 [781-1124](Homo sapiens (Human))
Astrazeneca
US Patent
LigandPNGBDBM264219((2R)-N-(3-{2-[(3- ethoxy-1-methyl-1H- pyrazol-4-yl...)
Affinity DataIC50: >3.00E+4nMpH: 7.3Assay Description:Enzyme inhibition studies were performed using recombinant JAK1 (amino acids 866-1154, Life Technologies, #PV4774, Carlsbad, Calif.), JAK2 (amino aci...
Ligand InfoPC cidPC sid
In DepthDetails US Patent
TargetTyrosine-protein kinase JAK1 [866-1154](Homo sapiens (Human))
Astrazeneca
US Patent
LigandPNGBDBM264219((2R)-N-(3-{2-[(3- ethoxy-1-methyl-1H- pyrazol-4-yl...)
Affinity DataIC50:  55nM. Assay description: Enzyme inhibition studies were performed using recombinant JAK1 (amino acids 866-1154, Life Technologies, #PV4774, Carlsbad, Calif.), JAK2 (amino aci...
Ligand InfoPC cidPC sid
In DepthDetails US Patent
TargetTyrosine-protein kinase JAK2 [808-1132](Homo sapiens (Human))
Dizal (Jiangsu) Pharmaceutical
US Patent
LigandPNGBDBM264219((2R)-N-(3-{2-[(3- ethoxy-1-methyl-1H- pyrazol-4-yl...)
Affinity DataIC50:  2.55E+4nM. Assay description: Enzyme inhibition studies were performed using recombinant JAK1 (amino acids 866-1154, Life Technologies, #PV4774, Carlsbad, Calif.), JAK2 (amino aci...
Ligand InfoPC cidPC sid
In DepthDetails US Patent
TargetTyrosine-protein kinase JAK3 [781-1124](Homo sapiens (Human))
Astrazeneca
US Patent
LigandPNGBDBM264219((2R)-N-(3-{2-[(3- ethoxy-1-methyl-1H- pyrazol-4-yl...)
Affinity DataIC50: >3.00E+4nM. Assay description: Enzyme inhibition studies were performed using recombinant JAK1 (amino acids 866-1154, Life Technologies, #PV4774, Carlsbad, Calif.), JAK2 (amino aci...
Ligand InfoPC cidPC sid
In DepthDetails US Patent
TargetTyrosine-protein kinase JAK1 [866-1154](Homo sapiens (Human))
Astrazeneca
US Patent
LigandPNGBDBM264219((2R)-N-(3-{2-[(3- ethoxy-1-methyl-1H- pyrazol-4-yl...)
Affinity DataIC50:  55nM. Assay description: Enzyme inhibition studies were performed using recombinant JAK1 (amino acids 866-1154, Life Technologies, PV4774, Carlsbad, Calif.), JAK2 (amino acid...
Ligand InfoPC cidPC sid
In DepthDetails US Patent
TargetTyrosine-protein kinase JAK2 [831-1132](Homo sapiens (Human))
Astrazeneca
US Patent
LigandPNGBDBM264219((2R)-N-(3-{2-[(3- ethoxy-1-methyl-1H- pyrazol-4-yl...)
Affinity DataIC50:  2.55E+4nM. Assay description: Enzyme inhibition studies were performed using recombinant JAK1 (amino acids 866-1154, Life Technologies, PV4774, Carlsbad, Calif.), JAK2 (amino acid...
Ligand InfoPC cidPC sid
In DepthDetails US Patent
TargetTyrosine-protein kinase JAK3 [781-1124](Homo sapiens (Human))
Astrazeneca
US Patent
LigandPNGBDBM264219((2R)-N-(3-{2-[(3- ethoxy-1-methyl-1H- pyrazol-4-yl...)
Affinity DataIC50: >3.00E+4nM. Assay description: Enzyme inhibition studies were performed using recombinant JAK1 (amino acids 866-1154, Life Technologies, PV4774, Carlsbad, Calif.), JAK2 (amino acid...
Ligand InfoPC cidPC sid
In DepthDetails US Patent
TargetTyrosine-protein kinase JAK1 [866-1154](Homo sapiens (Human))
Astrazeneca
US Patent
LigandPNGBDBM264219((2R)-N-(3-{2-[(3- ethoxy-1-methyl-1H- pyrazol-4-yl...)
Affinity DataIC50:  55nM. Assay description: Enzyme inhibition studies were performed using recombinant JAK1 (amino acids 866-1154, Life Technologies, #PV4774, Carlsbad, Calif.), JAK2 (amino aci...
Ligand InfoPC cidPC sid
In DepthDetails US Patent
TargetTyrosine-protein kinase JAK2 [831-1132](Homo sapiens (Human))
Astrazeneca
US Patent
LigandPNGBDBM264219((2R)-N-(3-{2-[(3- ethoxy-1-methyl-1H- pyrazol-4-yl...)
Affinity DataIC50:  2.55E+4nM. Assay description: Enzyme inhibition studies were performed using recombinant JAK1 (amino acids 866-1154, Life Technologies, #PV4774, Carlsbad, Calif.), JAK2 (amino aci...
Ligand InfoPC cidPC sid
In DepthDetails US Patent
TargetTyrosine-protein kinase JAK3 [811-1124](Homo sapiens (Human))
Dizal (Jiangsu) Pharmaceutical
US Patent
LigandPNGBDBM264219((2R)-N-(3-{2-[(3- ethoxy-1-methyl-1H- pyrazol-4-yl...)
Affinity DataIC50: >3.00E+4nM. Assay description: Enzyme inhibition studies were performed using recombinant JAK1 (amino acids 866-1154, Life Technologies, #PV4774, Carlsbad, Calif.), JAK2 (amino aci...
Ligand InfoPC cidPC sid
In DepthDetails US Patent