BDBM264278 6-(2,6-Dichlorophenyl)-2-((4-(4-methylpiperazine-1-carbonyl)phenyl)amino)pyrido[4,3-d]pyrimidin-5(6H)-one::US9714244, 32
SMILES CN1CCN(CC1)C(=O)c1ccc(Nc2ncc3c(ccn(-c4c(Cl)cccc4Cl)c3=O)n2)cc1
InChI Key InChIKey=MBYIXPHAXCEKFT-UHFFFAOYSA-N
Data  1 IC50
  Tab Delimited (TSV)   2D SDfile   Computed 3D by Vconf -m prep SDfile
Find this compound or compounds like it in BindingDB:
Activity Spreadsheet -- Enzyme Inhibition Constant Data from BindingDB
Found 1 hit for monomerid = 264278
TargetWee1-like protein kinase(Homo sapiens (Human))
Almac Discovery
US Patent
LigandPNGBDBM264278(6-(2,6-Dichlorophenyl)-2-((4-(4-methylpiperazine-1...)
Affinity DataIC50:  105nMT: 2°C. Assay description: In the measurement of Wee-1 activity, a commercial peptide Poly(Lys Tyr(4:1)) hydrobromide was purchased from Sigma Aldrich and used as the substrate...
Ligand InfoPC cidPC sid
In DepthDetails US Patent